{"text_format":"1","workbook":"xlsx","n_sheets":8,"sheets":["Teilnahmebedingungen","Spieler","1. Runde Gruppen","Matches","Berechnung","2. Runde Gruppen","Finals","Simplon GP"],"not_rendered":{"charts":0,"images":18,"macros":1,"external_links":0,"defined_names":8,"comments":0,"pivot_tables":0},"unopened":[],"bounds":{"document_bytes":16777216,"sheet_cells":100000,"rows_first":2000,"rows_last":500,"rows_between":2000,"halvings":0,"cell_chars":16384,"cell_head_chars":4096},"cells_cut":0,"cells_raw":0,"read":"whole","date_system":"1900"}

{"sheet":"Teilnahmebedingungen","index":0,"n_rows":0,"n_cols":0,"rows_kept":0,"cut":false,"hidden":false,"merged":[]}

{"sheet":"Spieler","index":1,"n_rows":501,"n_cols":48,"rows_kept":501,"cut":false,"hidden":false,"merged":[[36,16,36,18],[0,44,0,45],[43,0,43,3],[41,16,43,19],[18,31,33,31],[1,31,3,31],[5,31,9,31],[1,29,3,29],[5,29,9,29],[18,29,33,29],[11,19,11,26],[4,18,4,26],[25,16,25,18],[9,18,9,26],[10,18,10,26],[13,18,13,19],[24,16,24,19],[28,16,28,18],[32,16,32,18]]}
[null,null,"Spieler","Startgeld","Gesetzt","Los",null,null,{"$f":"AP501","v":0},null,null,null,null,{"$f":"E43","v":0},"von",{"$f":"IFERROR(Z14,0)","v":0},"gesetzte Spieler",{"$f":"IF(I1>P1,1,0)","v":0},null,null,{"$f":"IF(I1>P1,1,0)","v":0},null,null,null,null,null,null,"TN","Gruppen","Gesetzt","Modus R2","TN R2",{"$f":"IF(AND(AB36=\"\",AB37=\"\"),\"\",IF(S12>20,\"X\",AB36))","v":"X"},"TN","spielt","gesetzt","Spieler","Zufallszahl","GST",null,null,null,"Los",{"$f":"IFERROR(LARGE(AH2:AH500,1),0)","v":0},"Simplon Grand Prix",null,"Los"]
[1,{"$f":"IF(E2=\"\",A2,\"\")","v":1},{"$f":"IFERROR(VLOOKUP(A2,AH2:$AK$500,4,FALSE),\"\")","v":""},null,{"$f":"IFERROR(VLOOKUP(C2,$AK$2:$AN$500,4,FALSE),\"\")","v":""},{"$f":"IF(OR(C2=\"X\",C2=\"Y\",C2=\"Z\"),0,IF(C2<>\"\",1,0))","v":0},{"$f":"IF(C2<>\"\",1,0)","v":0},{"$f":"IF(E2=\"gesetzt\",C2,\"\")","v":""},null,{"$f":"IF(C2>\"\",C2,\"\")","v":""},{"$f":"IF(H2>0,1,\"\")","v":1},{"$f":"IF(ROW(H1)>COUNTA(H:H),\"\",INDEX(H:H,SMALL(IF(H$2:H$100<>\"\",ROW($2:$100)),ROW(H1))))","v":{"$error":"#NUM!"}},{"$f":"SMALL($K$2:$K$9,1)","v":1},{"$f":"IFERROR(VLOOKUP(M2,$K$2:$L$9,2,FALSE),\"\")","v":""},{"$f":"IF(AND(AG1=\"X\",S12>18),1,IF(AND(S12>16,S12<24),1,0))","v":0},{"$f":"IF(Q2>\"\",\"A1\",\"\")","v":""},{"$f":"N2","v":""},null,null,null,null,null,null,null,null,null,null,{"$f":"V14","v":8},{"$f":"X14","v":"2x4"},{"$f":"VLOOKUP(AB2,$V$14:$Y$46,4,FALSE)","v":2},"K.O.",4,{"$f":"IF(D2=\"\",\"\",IF(OR(D2=1,D2=\"OK\"),\"X\",IF(D2=2,\"y\")))","v":""},{"$f":"IF(AI2<>\"\",COUNTA($AI$2:$AI2),\"\")","v":""},null,null,"Bauer Matthias",{"$f":"IFERROR(IF(AI2=\"\",\"\",IF(AJ2=\"gesetzt\",RAND()*5000000,RAND()*1000*20)),\"\")","v":""},"ok",{"$f":"IF(AJ2=\"\",\"\",AJ2)","v":""},{"$f":"Berechnung!CZ2","v":""},{"$f":"IF(AN2=\"gesetzt\",1,0)","v":0},{"$f":"AO2","v":""},"E1",1,null,"A1",{"$f":"AT2","v":0}]
[2,{"$f":"IF(E3=\"\",A3,\"\")","v":2},{"$f":"IFERROR(VLOOKUP(A3,AH3:$AK$500,4,FALSE),\"\")","v":""},null,"",{"$f":"IF(OR(C3=\"X\",C3=\"Y\",C3=\"Z\"),0,IF(C3<>\"\",1,0))","v":0},{"$f":"IF(C3<>\"\",1,0)","v":0},{"$f":"IF(E3=\"gesetzt\",C3,\"\")","v":""},null,{"$f":"IF(C3>\"\",C3,\"\")","v":""},{"$f":"IF(H3>0,2,\"\")","v":2},{"$f":"IF(ROW(H2)>COUNTA(H:H),\"\",INDEX(H:H,SMALL(IF(H$2:H$100<>\"\",ROW($2:$100)),ROW(H2))))","v":{"$error":"#NUM!"}},{"$f":"SMALL($K$2:$K$9,2)","v":2},{"$f":"IFERROR(VLOOKUP(M3,$K$2:$L$9,2,FALSE),\"\")","v":""},{"$f":"IF(I1=0,0,IF(I1>P1,1,IF(P1>I1,1,0)))","v":0},{"$f":"IF(Q3>\"\",\"B1\",\"\")","v":""},{"$f":"N3","v":""},null,null,null,null,null,null,null,null,null,null,9,{"$f":"X15","v":"1x4 1x5"},null,"K.O.",null,"",{"$f":"IF(AI3<>\"\",COUNTA($AI$2:$AI3),\"\")","v":""},null,null,"Bauermann Christian","","ok",{"$f":"IF(AJ3=\"\",\"\",AJ3)","v":""},{"$f":"Berechnung!CZ3","v":""},{"$f":"IF(AN3=\"gesetzt\",1,0)","v":0},"","A1",2,null,"B1",{"$f":"AT3","v":0}]
[3,{"$f":"IF(E4=\"\",A4,\"\")","v":3},{"$f":"IFERROR(VLOOKUP(A4,AH4:$AK$500,4,FALSE),\"\")","v":""},null,"",0,0,"",null,"",{"$f":"IF(H4>0,3,\"\")","v":3},{"$f":"IF(ROW(H3)>COUNTA(H:H),\"\",INDEX(H:H,SMALL(IF(H$2:H$100<>\"\",ROW($2:$100)),ROW(H3))))","v":{"$error":"#NUM!"}},{"$f":"SMALL($K$2:$K$9,3)","v":3},"",null,{"$f":"IF(Q4>\"\",\"C1\",\"\")","v":""},"",null,null,null,null,null,null,null,null,null,null,10,"2x5",null,"K.O.",null,"",{"$f":"IF(AI4<>\"\",COUNTA($AI$2:$AI4),\"\")","v":""},null,null,"Beier Thomas","",null,"",{"$f":"Berechnung!CZ4","v":""},0,"","B1",3,null,null,0]
[4,4,{"$f":"IFERROR(VLOOKUP(A5,AH5:$AK$500,4,FALSE),\"\")","v":""},null,"",0,0,"",null,"",{"$f":"IF(H5>0,4,\"\")","v":4},{"$f":"IF(ROW(H4)>COUNTA(H:H),\"\",INDEX(H:H,SMALL(IF(H$2:H$100<>\"\",ROW($2:$100)),ROW(H4))))","v":{"$error":"#NUM!"}},{"$f":"SMALL($K$2:$K$9,4)","v":4},"",null,{"$f":"IF(Q5>\"\",\"D1\",\"\")","v":""},"",null,null,null,null,null,null,null,null,null,null,11,"1x3 2x4",{"$f":"VLOOKUP(AB5,$V$14:$Y$46,4,FALSE)","v":4},"K.O.",8,"",{"$f":"IF(AI5<>\"\",COUNTA($AI$2:$AI5),\"\")","v":""},null,null,"Belzl Achim","","ok","",{"$f":"Berechnung!CZ5","v":""},0,"","G1",4,null,null,0]
[5,5,{"$f":"IFERROR(VLOOKUP(A6,AH6:$AK$500,4,FALSE),\"\")","v":""},null,"",0,0,"",null,"",{"$f":"IF(H6>0,5,\"\")","v":5},{"$f":"IF(ROW(H5)>COUNTA(H:H),\"\",INDEX(H:H,SMALL(IF(H$2:H$100<>\"\",ROW($2:$100)),ROW(H5))))","v":{"$error":"#NUM!"}},{"$f":"SMALL($K$2:$K$9,5)","v":5},"",null,{"$f":"IF(Q6>\"\",\"E1\",\"\")","v":""},"",null,null,null,null,null,null,null,null,null,null,12,"4x3",{"$f":"VLOOKUP(AB6,$V$14:$Y$46,4,FALSE)","v":4},"K.O.",8,"",{"$f":"IF(AI6<>\"\",COUNTA($AI$2:$AI6),\"\")","v":""},null,null,"Bergmann Hans","","ok","",{"$f":"Berechnung!CZ6","v":""},0,"","C1",5,null,null,0]
[6,6,{"$f":"IFERROR(VLOOKUP(A7,AH7:$AK$500,4,FALSE),\"\")","v":""},null,"",0,0,"",null,"",{"$f":"IF(H7>0,6,\"\")","v":6},{"$f":"IF(ROW(H6)>COUNTA(H:H),\"\",INDEX(H:H,SMALL(IF(H$2:H$100<>\"\",ROW($2:$100)),ROW(H6))))","v":{"$error":"#NUM!"}},{"$f":"SMALL($K$2:$K$9,6)","v":6},"",null,{"$f":"IF(Q7>\"\",\"F1\",\"\")","v":""},"",null,null,null,null,null,null,null,null,null,null,13,"3x3 1x4",null,"K.O.",null,"",{"$f":"IF(AI7<>\"\",COUNTA($AI$2:$AI7),\"\")","v":""},null,null,"Brachmanski Dave","","ok","",{"$f":"Berechnung!CZ7","v":""},0,"","F1",6,null,null,0]
[7,7,{"$f":"IFERROR(VLOOKUP(A8,AH8:$AK$500,4,FALSE),\"\")","v":""},null,"",0,0,"",null,"",{"$f":"IF(H8>0,7,\"\")","v":7},{"$f":"IF(ROW(H7)>COUNTA(H:H),\"\",INDEX(H:H,SMALL(IF(H$2:H$100<>\"\",ROW($2:$100)),ROW(H7))))","v":{"$error":"#NUM!"}},{"$f":"SMALL($K$2:$K$9,7)","v":7},"",null,{"$f":"IF(Q8>\"\",\"G1\",\"\")","v":""},"",null,null,null,null,null,null,null,null,null,null,14,"2x3 2x4",null,"K.O.",null,"",{"$f":"IF(AI8<>\"\",COUNTA($AI$2:$AI8),\"\")","v":""},null,null,"Brettschneider Bernd","","ok","",{"$f":"Berechnung!CZ8","v":""},0,"","H1",7,null,null,0]
[8,8,{"$f":"IFERROR(VLOOKUP(A9,AH9:$AK$500,4,FALSE),\"\")","v":""},null,"",0,0,"",null,"",{"$f":"IF(H9>0,8,\"\")","v":8},{"$f":"IF(ROW(H8)>COUNTA(H:H),\"\",INDEX(H:H,SMALL(IF(H$2:H$100<>\"\",ROW($2:$100)),ROW(H8))))","v":{"$error":"#NUM!"}},{"$f":"SMALL($K$2:$K$9,8)","v":8},"",null,{"$f":"IF(Q9>\"\",\"H1\",\"\")","v":""},"",null,null,null,null,null,null,null,null,null,null,15,"1x3 3x4",null,"K.O.",null,"",{"$f":"IF(AI9<>\"\",COUNTA($AI$2:$AI9),\"\")","v":""},null,null,"Brömel Frank","","ok","",{"$f":"Berechnung!CZ9","v":""},0,"","D1",8,null,null,0]
[9,9,{"$f":"IFERROR(VLOOKUP(A10,AH10:$AK$500,4,FALSE),\"\")","v":""},null,"",0,0,"",null,"",null,null,{"$f":"SMALL($B$2:$B$41,1)","v":1},{"$f":"IFERROR(VLOOKUP(M10,$B$2:$C$41,2,FALSE),\"\")","v":""},null,null,"Setzliste ab 20 Teilnehmer",null,"    PW Namenseingabe = 147",null,null,null,null,null,null,null,null,16,"4x4",null,"K.O.",null,"",{"$f":"IF(AI10<>\"\",COUNTA($AI$2:$AI10),\"\")","v":""},null,null,"Delling Tino","","ok","",{"$f":"Berechnung!CZ10","v":""},0,"","D3"]
[10,10,{"$f":"IFERROR(VLOOKUP(A11,AH11:$AK$500,4,FALSE),\"\")","v":""},null,"",0,0,"",null,"",null,null,{"$f":"SMALL($B$2:$B$41,2)","v":2},{"$f":"IFERROR(VLOOKUP(M11,$B$2:$C$41,2,FALSE),\"\")","v":""},null,null,"Freigabe-Code Finals: 148",null,"    PW Punktevergabe  = 147",null,null,null,null,null,null,null,null,17,"1x5 3x4",{"$f":"VLOOKUP(AB11,$V$14:$Y$46,4,FALSE)","v":4},{"$f":"IF(AND(S12=17,AG1=\"X\"),\"K.O.\",\"Gruppen\")","v":"Gruppen"},{"$f":"IF(AND(S12<21,AG1=\"X\"),8,12)","v":8},"",{"$f":"IF(AI11<>\"\",COUNTA($AI$2:$AI11),\"\")","v":""},null,null,"Drahn Robert","",null,"",{"$f":"Berechnung!CZ11","v":""},0,"","E3"]
[11,11,{"$f":"IFERROR(VLOOKUP(A12,AH12:$AK$500,4,FALSE),\"\")","v":""},null,"",0,0,"",null,"",null,null,{"$f":"SMALL($B$2:$B$41,3)","v":3},"",null,null,"Startgeld = 20,00 €",null,{"$f":"G43","v":0},"Spieler nehmen teil",null,null,null,null,null,null,null,18,{"$f":"X24","v":"2x5 2x4"},{"$f":"VLOOKUP(AB12,$V$14:$Y$46,4,FALSE)","v":4},{"$f":"IF(AND(S12=18,AG1=\"X\"),\"K.O.\",\"Gruppen\")","v":"Gruppen"},{"$f":"IF(AND(S122<21,AG1=\"X\"),8,12)","v":8},"",{"$f":"IF(AI12<>\"\",COUNTA($AI$2:$AI12),\"\")","v":""},null,null,"Elham Faiz","","ok","",{"$f":"Berechnung!CZ12","v":""},0,"","B2"]
[12,12,{"$f":"IFERROR(VLOOKUP(A13,AH13:$AK$500,4,FALSE),\"\")","v":""},null,"",0,0,"",null,"",null,null,{"$f":"SMALL($B$2:$B$41,4)","v":4},"",null,null,"Version: 21.12.2025",null,"Modus:",{"$f":"IFERROR(VLOOKUP(S12,$AB$2:$AC$46,2,FALSE),\"\")","v":""},null,null,null,null,null,null,"Gruppen",19,{"$f":"X25","v":"3x5 1x4"},null,{"$f":"IF(AND(S12=19,AG1=\"X\"),\"K.O.\",\"Gruppen\")","v":"Gruppen"},null,"",{"$f":"IF(AI13<>\"\",COUNTA($AI$2:$AI13),\"\")","v":""},null,null,"Elstermann Markus","",null,"",{"$f":"Berechnung!CZ13","v":""},0,"","A2"]
[13,13,{"$f":"IFERROR(VLOOKUP(A14,AH14:$AK$500,4,FALSE),\"\")","v":""},null,"",0,0,"",null,"",null,null,{"$f":"SMALL($B$2:$B$41,5)","v":5},"",null,null,"© Copyright by T. Delling",null,"Shootoutzeit einstellen:",null,null,8,null,"2x4",2,{"$f":"VLOOKUP(S12,$V$14:$Y$46,4,FALSE)","v":{"$error":"#N/A"}},"00:55:00",20,"4x5",null,{"$f":"IF(AND(S12=20,AG1=\"X\"),\"K.O.\",\"Gruppen\")","v":"Gruppen"},null,"",{"$f":"IF(AI14<>\"\",COUNTA($AI$2:$AI14),\"\")","v":""},null,null,"Evers Mike","",null,"",{"$f":"Berechnung!CZ14","v":""},0,"","H3"]
[14,14,{"$f":"IFERROR(VLOOKUP(A15,AH15:$AK$500,4,FALSE),\"\")","v":""},null,"",0,0,"",null,"",null,null,{"$f":"SMALL($B$2:$B$41,6)","v":6},"",null,null,"Bei Fragen: 147max@freenet.de",null,"Reset - Code: 1309",null,null,9,null,"1x4 1x5",2,{"$f":"IF(AND(S12<21,AG1=\"X\"),4,IF(AND(AG1=\"X\",S12=24),6,0))","v":4},"VBA: 2101",21,"3x4 3x3",{"$f":"VLOOKUP(AB15,$V$14:$Y$46,4,FALSE)","v":6},"Gruppen",12,"",{"$f":"IF(AI15<>\"\",COUNTA($AI$2:$AI15),\"\")","v":""},null,null,"Fandrei Andreas","","ok","",{"$f":"Berechnung!CZ15","v":""},0,"","H2"]
[15,15,{"$f":"IFERROR(VLOOKUP(A16,AH16:$AK$500,4,FALSE),\"\")","v":""},null,"",0,0,"",null,"",null,null,{"$f":"SMALL($B$2:$B$41,7)","v":7},"",null,null,"Tel.: 0174 / 3076906",null,"setzt die Auslosung zurück",null,null,10,null,"2x5",2,null,null,{"$f":"V28","v":22},"4x4 2x3",null,"Gruppen",null,"",{"$f":"IF(AI16<>\"\",COUNTA($AI$2:$AI16),\"\")","v":""},null,null,"Fandrei Joel","","ok","",{"$f":"Berechnung!CZ16","v":""},0,"","G3"]
[16,16,{"$f":"IFERROR(VLOOKUP(A17,AH17:$AK$500,4,FALSE),\"\")","v":""},null,"",0,0,"",null,"",null,null,{"$f":"SMALL($B$2:$B$41,8)","v":8},"",null,null,"Platzierung","12-15 TN","8-15 TN","16-23 TN",null,11,null,"1x3 2x4",{"$f":"IF(AG1=\"\",3,4)","v":4},null,"24-40 TN",23,"5x4 1x3",null,"Gruppen",null,"",{"$f":"IF(AI17<>\"\",COUNTA($AI$2:$AI17),\"\")","v":""},null,null,"Fertellioglu Bugharan","",null,"",{"$f":"Berechnung!CZ17","v":""},0,"","C3"]
[17,17,{"$f":"IFERROR(VLOOKUP(A18,AH18:$AK$500,4,FALSE),\"\")","v":""},null,"",0,0,"",null,"",null,null,{"$f":"SMALL($B$2:$B$41,9)","v":9},"",null,null,"1. Platz",150,150,250,null,12,null,"4x3",4,null,350,24,"8x3",{"$f":"VLOOKUP(AB18,$V$14:$Y$46,4,FALSE)","v":8},{"$f":"IF(AND(S12=24,AG1=\"\"),\"Gruppen\",\"K.O.\")","v":"K.O."},{"$f":"IF(AND(S122<21,AG1=\"X\"),16,12)","v":16},"",{"$f":"IF(AI18<>\"\",COUNTA($AI$2:$AI18),\"\")","v":""},null,null,"Gabriel Christian","",null,"",{"$f":"Berechnung!CZ18","v":""},0,"","F2"]
[18,18,{"$f":"IFERROR(VLOOKUP(A19,AH19:$AK$500,4,FALSE),\"\")","v":""},null,"",0,0,"",null,"",null,null,{"$f":"SMALL($B$2:$B$41,10)","v":10},"",null,null,"2. Platz",120,120,200,null,13,null,"3x3 1x4",4,null,300,25,"7x3 1x4",{"$f":"VLOOKUP(AB19,$V$14:$Y$46,4,FALSE)","v":8},"K.O.",16,"",{"$f":"IF(AI19<>\"\",COUNTA($AI$2:$AI19),\"\")","v":""},null,null,"Gehrke Mario","",null,"",{"$f":"Berechnung!CZ19","v":""},0,"","F3"]
[19,19,{"$f":"IFERROR(VLOOKUP(A20,AH20:$AK$500,4,FALSE),\"\")","v":""},null,"",0,0,"",null,"",null,null,{"$f":"SMALL($B$2:$B$41,11)","v":11},"",null,null,"3. Platz",100,90,140,null,14,null,"2x3 2x4",4,null,230,26,"6x3 2x4",null,"K.O.",null,"",{"$f":"IF(AI20<>\"\",COUNTA($AI$2:$AI20),\"\")","v":""},null,null,"Grüner Ann-Cathrin","","ok","",{"$f":"Berechnung!CZ20","v":""},0,"","B3"]
[20,20,{"$f":"IFERROR(VLOOKUP(A21,AH21:$AK$500,4,FALSE),\"\")","v":""},null,"",0,0,"",null,{"$f":"IF(C21>\"\",C21,\"\")","v":""},null,null,{"$f":"SMALL($B$2:$B$41,12)","v":12},"",null,null,"3. Platz",80,90,140,null,15,null,"1x3 3x4",4,null,230,27,"5x3 3x4",null,"K.O.",null,"",{"$f":"IF(AI21<>\"\",COUNTA($AI$2:$AI21),\"\")","v":""},null,null,"Hänel Holger","",null,"",{"$f":"Berechnung!CZ21","v":""},0,"","E2"]
[21,21,{"$f":"IFERROR(VLOOKUP(A22,AH22:$AK$500,4,FALSE),\"\")","v":""},null,"",0,0,"",null,"",null,null,{"$f":"SMALL($B$2:$B$41,13)","v":13},"",null,null,"Viertelfinale",50,50,100,null,16,null,"4x4",4,null,150,28,"4x3 4x4",null,"K.O.",null,"",{"$f":"IF(AI22<>\"\",COUNTA($AI$2:$AI22),\"\")","v":""},null,null,"Helbig Kevin","",null,"",{"$f":"Berechnung!CZ22","v":""},0,"","A3"]
[22,22,{"$f":"IFERROR(VLOOKUP(A23,AH23:$AK$500,4,FALSE),\"\")","v":""},null,"",0,0,"",null,"",null,null,{"$f":"SMALL($B$2:$B$41,14)","v":14},"",null,null,"2. Runde (Gr. o. AF)",null,"-",60,null,17,null,{"$f":"IF(AG1=\"X\",\"1x5 3x4\",\"2x4 3x3\")","v":"1x5 3x4"},{"$f":"IF(AG1=\"\",5,4)","v":4},null,100,29,"3x3 5x4",null,"K.O.",null,"",{"$f":"IF(AI23<>\"\",COUNTA($AI$2:$AI23),\"\")","v":""},null,null,"Hermsdorf Hannes","",null,"",{"$f":"Berechnung!CZ23","v":""},0,"","C2"]
[23,23,{"$f":"IFERROR(VLOOKUP(A24,AH24:$AK$500,4,FALSE),\"\")","v":""},null,"",0,0,"",null,"",null,null,{"$f":"SMALL($B$2:$B$41,15)","v":15},"",null,null,"Teilnahme",null,20,30,null,18,null,{"$f":"IF(AG1=\"X\",\"2x5 2x4\",\"6x3\")","v":"2x5 2x4"},{"$f":"IF($AG$1=\"\",6,4)","v":4},null,50,30,"2x3 6x4",null,"K.O.",null,"",{"$f":"IF(AI24<>\"\",COUNTA($AI$2:$AI24),\"\")","v":""},null,null,"Hirth Christian","",null,"",{"$f":"Berechnung!CZ24","v":""},0,"","G2"]
[24,24,{"$f":"IFERROR(VLOOKUP(A25,AH25:$AK$500,4,FALSE),\"\")","v":""},null,"",0,0,"",null,"",null,null,{"$f":"SMALL($B$2:$B$41,16)","v":16},"",null,null,"Pro gewonnenen Frame & Break 30+ je 5 Punkte",null,null,null,null,19,null,{"$f":"IF(AG1=\"X\",\"3x5 1x4\",\"5x3 1x4\")","v":"3x5 1x4"},{"$f":"IF($AG$1=\"\",6,4)","v":4},null,null,31,"1x3 7x4",null,"K.O.",null,"",{"$f":"IF(AI25<>\"\",COUNTA($AI$2:$AI25),\"\")","v":""},null,null,"Hofmann Frank","",null,"",{"$f":"Berechnung!CZ25","v":""},0,"","D2"]
[25,25,{"$f":"IFERROR(VLOOKUP(A26,AH26:$AK$500,4,FALSE),\"\")","v":""},null,"",0,0,"",null,"",null,null,{"$f":"SMALL($B$2:$B$41,17)","v":17},"",null,null,"Start- / Preisgeldberechnung",null,null,"Gesamt",null,20,null,{"$f":"IF(AG1=\"X\",\"4x5\",\"2x4 4x3\")","v":"4x5"},{"$f":"IF($AG$1=\"\",6,4)","v":4},null,null,32,"8x4",null,"K.O.",null,"",{"$f":"IF(AI26<>\"\",COUNTA($AI$2:$AI26),\"\")","v":""},null,null,"Hollin Andreas","","ok","",{"$f":"Berechnung!CZ26","v":""},0,"",""]
[26,26,{"$f":"IFERROR(VLOOKUP(A27,AH27:$AK$500,4,FALSE),\"\")","v":""},null,"",0,0,"",null,"",null,null,{"$f":"SMALL($B$2:$B$41,18)","v":18},"",null,null,"Startgeld pro Spieler:",null,20,{"$f":"S27*D42","v":0},null,21,null,"3x4 3x3",6,null,null,33,"7x4 1x5",null,"K.O.",null,"",{"$f":"IF(AI27<>\"\",COUNTA($AI$2:$AI27),\"\")","v":""},null,null,"Hollnagel Gustav","",null,"",{"$f":"Berechnung!CZ27","v":""},0,"",""]
[27,27,{"$f":"IFERROR(VLOOKUP(A28,AH28:$AK$500,4,FALSE),\"\")","v":""},null,"",0,0,"",null,"",null,null,{"$f":"SMALL($B$2:$B$41,19)","v":19},"",null,null,"Teilnahme / GST Jackpot:",null,2,{"$f":"S28*D42","v":0},null,22,null,"4x4 2x3",6,null,null,34,"6x4 2x5",null,"K.O.",null,"",{"$f":"IF(AI28<>\"\",COUNTA($AI$2:$AI28),\"\")","v":""},null,null,"Ilmer Daniel","",null,"",{"$f":"Berechnung!CZ28","v":""},0,"",""]
[28,28,{"$f":"IFERROR(VLOOKUP(A29,AH29:$AK$500,4,FALSE),\"\")","v":""},null,"",0,0,"",null,"",null,null,{"$f":"SMALL($B$2:$B$41,20)","v":20},"",null,null,"TN Gesamt / Preisgeld:",null,null,{"$f":"T27-T28","v":0},null,23,null,"5x4 1x3",6,null,null,35,"5x4 3x5",null,"K.O.",null,"",{"$f":"IF(AI29<>\"\",COUNTA($AI$2:$AI29),\"\")","v":""},null,null,"Jacob Frank","",null,"",{"$f":"Berechnung!CZ29","v":""},0,"",""]
[29,29,{"$f":"IFERROR(VLOOKUP(A30,AH30:$AK$500,4,FALSE),\"\")","v":""},null,"",0,0,"",null,"",null,null,{"$f":"SMALL($B$2:$B$41,21)","v":21},"",null,null,"Jackpot 3LR:",null,2,{"$f":"D42*S30","v":0},null,24,null,{"$f":"IF(AG1=\"\",\"6x4\",IF(AG1=\"X\",\"8x3\"))","v":"8x3"},{"$f":"IF(AG1=\"\",6,8)","v":8},null,null,{"$f":"V42","v":36},"4x4 4x5",null,"K.O.",null,"",{"$f":"IF(AI30<>\"\",COUNTA($AI$2:$AI30),\"\")","v":""},null,null,"Jaritz Christopher","","ok","",{"$f":"Berechnung!CZ30","v":""},0,"",""]
[30,30,{"$f":"IFERROR(VLOOKUP(A31,AH31:$AK$500,4,FALSE),\"\")","v":""},null,"",0,0,"",null,"",null,null,{"$f":"SMALL($B$2:$B$41,22)","v":22},"",null,null,"Jackpot 100+:",null,1,{"$f":"D42*S31","v":0},null,25,null,"7x3 1x4",8,null,null,37,"3x4 5x5",null,"K.O.",null,"",{"$f":"IF(AI31<>\"\",COUNTA($AI$2:$AI31),\"\")","v":""},null,null,"Jeroch Paul","","ok","",{"$f":"Berechnung!CZ31","v":""},0,"",""]
[31,31,{"$f":"IFERROR(VLOOKUP(A32,AH32:$AK$500,4,FALSE),\"\")","v":""},null,"",0,0,"",null,"",null,null,{"$f":"SMALL($B$2:$B$41,23)","v":23},"",null,null,"Charity Topf:",null,2,{"$f":"D42*S32","v":0},null,26,null,"6x3 2x4",8,null,null,38,"2x4 6x5",null,"K.O.",null,"",{"$f":"IF(AI32<>\"\",COUNTA($AI$2:$AI32),\"\")","v":""},null,null,"Jungk Christian","",null,"",{"$f":"Berechnung!CZ32","v":""},0,"",""]
[32,32,{"$f":"IFERROR(VLOOKUP(A33,AH33:$AK$500,4,FALSE),\"\")","v":""},null,"",0,0,"",null,"",null,null,{"$f":"SMALL($B$2:$B$41,24)","v":24},"",null,null,"Ausschüttung / Jackpot:",null,null,{"$f":"T29-T30-T31-T32","v":0},null,27,null,"5x3 3x4",8,null,null,39,"1x4 7x5",null,"K.O.",null,"",{"$f":"IF(AI33<>\"\",COUNTA($AI$2:$AI33),\"\")","v":""},null,null,"Kandler Michael","","ok","",{"$f":"Berechnung!CZ33","v":""},0,"",""]
[33,33,{"$f":"IFERROR(VLOOKUP(A34,AH34:$AK$500,4,FALSE),\"\")","v":""},null,"",0,0,"",null,"",null,null,{"$f":"SMALL($B$2:$B$41,25)","v":25},"",null,null,"1. Platz",null,"1 x 45%",{"$f":"T33*45%","v":0},null,28,null,"4x3 4x4",8,null,null,40,"8x5",null,"K.O.",null,"",{"$f":"IF(AI34<>\"\",COUNTA($AI$2:$AI34),\"\")","v":""},null,null,"Kaufmann Luca","",null,"",{"$f":"Berechnung!CZ34","v":""},0,"",""]
[34,34,{"$f":"IFERROR(VLOOKUP(A35,AH35:$AK$500,4,FALSE),\"\")","v":""},null,"",0,0,{"$f":"IF(E35=\"x\",C35,\"\")","v":""},null,"",null,null,{"$f":"SMALL($B$2:$B$41,26)","v":26},"",null,null,"2. Platz",null,"1 x 25%",{"$f":"T33*25%","v":0},null,29,null,"3x3 5x4",8,null,null,null,null,null,null,null,"",{"$f":"IF(AI35<>\"\",COUNTA($AI$2:$AI35),\"\")","v":""},null,null,"Kensy Tobias","",null,"",{"$f":"Berechnung!CZ35","v":""},0,"",""]
[35,35,{"$f":"IFERROR(VLOOKUP(A36,AH36:$AK$500,4,FALSE),\"\")","v":""},null,"",0,0,"",null,"",null,null,{"$f":"SMALL($B$2:$B$41,27)","v":27},"",null,null,"3. Platz",null,"2 x 15%",{"$f":"T33*15%","v":0},{"$f":"T36*2","v":0},30,null,"2x3 6x4",8,null,null,"X","    Änderung den Gruppen bei 17-24 TN",null,null,null,"",{"$f":"IF(AI36<>\"\",COUNTA($AI$2:$AI36),\"\")","v":""},null,null,"Kirim Ali","","ok","",{"$f":"Berechnung!CZ36","v":""},0,"",""]
[36,36,{"$f":"IFERROR(VLOOKUP(A37,AH37:$AK$500,4,FALSE),\"\")","v":""},null,"",0,0,"",null,"",null,null,{"$f":"SMALL($B$2:$B$41,28)","v":28},"",null,null,"Prüfsumme:",null,null,{"$f":"SUM(T34+T35+T36*2)","v":0},null,31,null,"1x3 7x4",8,null,null,{"$f":"IF(S12<17,\"X\",IF(S12>20,\"X\",\"\"))","v":"X"},null,null,null,null,"",{"$f":"IF(AI37<>\"\",COUNTA($AI$2:$AI37),\"\")","v":""},null,null,"Kirsten Felix","",null,"",{"$f":"Berechnung!CZ37","v":""},0,"",""]
[37,37,{"$f":"IFERROR(VLOOKUP(A38,AH38:$AK$500,4,FALSE),\"\")","v":""},null,"",0,0,"",null,"",null,null,{"$f":"SMALL($B$2:$B$41,29)","v":29},"",null,null,"Jackpot (Anzahl aller TN):",null,42,{"$f":"S38*S30","v":84},null,32,null,"8x4",8,null,null,null,null,null,null,null,"",{"$f":"IF(AI38<>\"\",COUNTA($AI$2:$AI38),\"\")","v":""},null,null,"Kramer Kurt","","ok","",{"$f":"Berechnung!CZ38","v":""},0,"",""]
[38,38,{"$f":"IFERROR(VLOOKUP(A39,AH39:$AK$500,4,FALSE),\"\")","v":""},null,"",0,0,"",null,"",null,null,{"$f":"SMALL($B$2:$B$41,30)","v":30},"",null,null,"GST Gebühr 10€ pro Saison:",null,0,{"$f":"S39*10","v":0},null,33,null,"7x4 1x5",8,null,null,null,null,null,null,null,"",{"$f":"IF(AI39<>\"\",COUNTA($AI$2:$AI39),\"\")","v":""},null,null,"Kreku Arsonel","","ok","",{"$f":"Berechnung!CZ39","v":""},0,"",""]
[39,39,{"$f":"IFERROR(VLOOKUP(A40,AH40:$AK$500,4,FALSE),\"\")","v":""},null,"",0,0,"",null,"",null,null,{"$f":"SMALL($B$2:$B$41,31)","v":31},"",null,null,"Startgeld Simplon Grand Prix:",null,25,{"$f":"S40*8","v":200},null,34,null,"6x4 2x5",8,null,null,null,null,null,null,null,"",{"$f":"IF(AI40<>\"\",COUNTA($AI$2:$AI40),\"\")","v":""},null,null,"Larbi Hilibane Moh.","","ok","",{"$f":"Berechnung!CZ40","v":""},0,"",""]
[40,40,{"$f":"IFERROR(VLOOKUP(A41,AH41:$AK$500,4,FALSE),\"\")","v":""},null,"",0,0,"",null,"",null,null,{"$f":"SMALL($B$2:$B$41,32)","v":32},"",null,null,"Jackpot+Sponsorgeld:",null,300,{"$f":"T38+S41+T40","v":584},null,35,null,"5x4 3x5",8,null,null,null,null,null,null,null,{"$f":"IF(D41=\"\",\"\",IF(OR(D41=1,D41=\"OK\"),\"X\",IF(D41=2,\"y\")))","v":""},{"$f":"IF(AI41<>\"\",COUNTA($AI$2:$AI41),\"\")","v":""},null,null,"Leisegang Marco","","ok","",{"$f":"Berechnung!CZ41","v":""},0,"",""]
[null,null,null,{"$f":"COUNTA(D2:D41)","v":0},null,0,0,null,null,null,null,null,{"$f":"SMALL($B$2:$B$41,33)","v":33},"",null,null,"Simplon Grand Prix",null,null,null,null,36,null,"4x4 4x5",8,null,null,null,null,null,null,null,{"$f":"COUNTIF(AG2:AG41,\"X\")","v":0},{"$f":"IF(AI42<>\"\",COUNTA($AI$2:$AI42),\"\")","v":""},null,null,"Löffel Ulrich","","ok","",null,0]
[null,null,null,null,null,{"$f":"SUM(F2:F41)","v":0},{"$f":"SUM(G2:G41)","v":0},null,null,null,null,null,{"$f":"SMALL($B$2:$B$41,34)","v":34},"",null,null,null,null,null,null,null,37,null,"3x4 5x5",8,null,null,null,null,null,null,null,{"$f":"COUNTIF(AG2:AG41,\"Y\")","v":0},{"$f":"IF(AI43<>\"\",COUNTA($AI$2:$AI43),\"\")","v":""},null,null,"Lux Sebastian","",null,"",null,0]
["Mindesteilnehmerzahl sind 8 Spieler!",null,null,null,null,null,null,null,null,null,null,null,{"$f":"SMALL($B$2:$B$41,35)","v":35},"",null,null,null,null,null,null,null,38,null,"2x4 6x5",8,null,null,null,null,null,null,null,null,{"$f":"IF(AI44<>\"\",COUNTA($AI$2:$AI44),\"\")","v":""},null,null,"Matka Thomas","",null,"",null,0]
[null,null,null,null,null,null,null,null,null,null,null,null,{"$f":"SMALL($B$2:$B$41,36)","v":36},"",null,null,"Platz 1",null,0.35,{"$f":"$T$41*S45","v":204.39999999999998},null,39,null,"1x4 7x5",8,null,null,null,null,null,null,null,null,{"$f":"IF(AI45<>\"\",COUNTA($AI$2:$AI45),\"\")","v":""},null,null,"Muhammad Umer","",null,"",null,0]
[null,null,null,null,null,null,null,null,null,null,null,null,{"$f":"SMALL($B$2:$B$41,37)","v":37},{"$f":"IFERROR(VLOOKUP(M46,$B$2:$C$41,2,FALSE),\"\")","v":""},null,null,"Platz 2",null,0.2,{"$f":"$T$41*S46","v":116.80000000000001},null,40,null,"8x5",8,null,null,null,null,null,null,null,null,{"$f":"IF(AI46<>\"\",COUNTA($AI$2:$AI46),\"\")","v":""},null,null,"Müller Marcus","","ok","",null,0]
[null,null,null,null,null,null,null,null,null,null,null,null,{"$f":"SMALL($B$2:$B$41,38)","v":38},{"$f":"IFERROR(VLOOKUP(M47,$B$2:$C$41,2,FALSE),\"\")","v":""},null,null,"Platz 3",null,0.15,87.6,null,null,null,null,null,null,null,null,null,null,null,null,null,{"$f":"IF(AI47<>\"\",COUNTA($AI$2:$AI47),\"\")","v":""},null,null,"Müller Tom","",null,"",null,0]
[null,null,null,null,null,null,null,null,null,null,null,null,{"$f":"SMALL($B$2:$B$41,39)","v":39},"",null,null,"Platz 4",null,0.1,58.400000000000006,null,null,null,null,null,null,null,null,null,null,null,null,null,{"$f":"IF(AI48<>\"\",COUNTA($AI$2:$AI48),\"\")","v":""},null,null,"Musiienko Maksym","",null,"",null,0]
[null,null,null,null,null,null,null,null,null,null,null,null,{"$f":"SMALL($B$2:$B$41,40)","v":40},"",null,null,"Platz 5",null,0.05,29.200000000000003,null,null,null,null,null,null,null,null,null,null,null,null,null,{"$f":"IF(AI49<>\"\",COUNTA($AI$2:$AI49),\"\")","v":""},null,null,"Ohlenroth Sven","","ok","",null,0]
[null,null,null,null,null,null,null,null,null,null,null,null,null,null,null,null,"Platz 6",null,0.05,29.200000000000003,null,null,null,null,null,null,null,null,null,null,null,null,null,{"$f":"IF(AI50<>\"\",COUNTA($AI$2:$AI50),\"\")","v":""},null,null,"Pfeiffer Jakob","",null,"",null,0]
[null,null,null,null,null,null,null,null,null,null,null,null,null,null,null,null,"Platz 7",null,0.05,29.200000000000003,null,null,null,null,null,null,null,null,null,null,null,null,null,{"$f":"IF(AI51<>\"\",COUNTA($AI$2:$AI51),\"\")","v":""},null,null,"Rejke Ronny","","ok","",null,0]
[null,null,null,null,null,null,null,null,null,null,null,null,null,null,null,null,"Platz 8",null,0.05,29.200000000000003,null,null,null,null,null,null,null,false,null,null,null,null,null,{"$f":"IF(AI52<>\"\",COUNTA($AI$2:$AI52),\"\")","v":""},null,null,"Riedel Ronald","","ok","",null,0]
[null,null,null,null,null,null,null,null,null,null,null,null,null,null,null,null,"Prüfsumme:",null,{"$f":"SUM(S45:S52)","v":1.0000000000000002},{"$f":"SUM(T45:T52)","v":584},null,null,null,null,null,null,null,null,null,null,null,null,null,{"$f":"IF(AI53<>\"\",COUNTA($AI$2:$AI53),\"\")","v":""},null,null,"Rosenberger Carl","",null,"",null,0]
[null,null,null,null,null,null,null,null,null,null,null,null,null,null,null,null,null,null,null,null,null,null,null,null,null,null,null,null,null,null,null,null,null,{"$f":"IF(AI54<>\"\",COUNTA($AI$2:$AI54),\"\")","v":""},null,null,"Scheurer Rene","",null,"",null,0]
[null,null,null,null,null,null,null,null,null,null,null,null,null,null,null,null,null,null,null,null,null,null,null,null,null,null,null,null,null,null,null,null,null,{"$f":"IF(AI55<>\"\",COUNTA($AI$2:$AI55),\"\")","v":""},null,null,"Schmid Christian","",null,"",null,0]
[null,null,null,null,null,null,null,null,null,null,null,null,null,null,null,null,null,null,null,null,null,null,null,null,null,null,null,null,null,null,null,null,null,{"$f":"IF(AI56<>\"\",COUNTA($AI$2:$AI56),\"\")","v":""},null,null,"Schnaubelt Hellmut","","ok","",null,0]
[null,null,null,null,null,null,null,null,null,null,null,null,null,null,null,null,null,null,null,null,null,null,null,null,null,null,null,null,null,null,null,null,null,{"$f":"IF(AI57<>\"\",COUNTA($AI$2:$AI57),\"\")","v":""},null,null,"Schneider Daniel","",null,"",null,0]
[null,null,null,null,null,null,null,null,null,null,null,null,null,null,null,null,null,null,null,null,null,null,null,null,null,null,null,null,null,null,null,null,null,{"$f":"IF(AI58<>\"\",COUNTA($AI$2:$AI58),\"\")","v":""},null,null,"Schwarze Bernhard","",null,"",null,0]
[null,null,null,null,null,null,null,null,null,null,null,null,null,null,null,null,null,null,null,null,null,null,null,null,null,null,null,null,null,null,null,null,null,{"$f":"IF(AI59<>\"\",COUNTA($AI$2:$AI59),\"\")","v":""},null,null,"Seidel Michael","","ok","",null,0]
[null,null,null,null,null,null,null,null,null,null,null,null,null,null,null,null,null,null,null,null,null,null,null,null,null,null,null,null,null,null,null,null,null,{"$f":"IF(AI60<>\"\",COUNTA($AI$2:$AI60),\"\")","v":""},null,null,"Simon Fabio","",null,"",null,0]
[null,null,null,null,null,null,null,null,null,null,null,null,null,null,null,null,null,null,null,null,null,null,null,null,null,null,null,null,null,null,null,null,null,{"$f":"IF(AI61<>\"\",COUNTA($AI$2:$AI61),\"\")","v":""},null,null,"Sinden Leonard","","ok","",null,0]
[null,null,null,null,null,null,null,null,null,null,null,null,null,null,null,null,null,null,null,null,null,null,null,null,null,null,null,null,null,null,null,null,null,{"$f":"IF(AI62<>\"\",COUNTA($AI$2:$AI62),\"\")","v":""},null,null,"Stachly Marec","","ok","",null,0]
[null,null,null,null,null,null,null,null,null,null,null,null,null,null,null,null,null,null,null,null,null,null,null,null,null,null,null,null,null,null,null,null,null,{"$f":"IF(AI63<>\"\",COUNTA($AI$2:$AI63),\"\")","v":""},null,null,"Stahl Volker","","ok","",null,0]
[null,null,null,null,null,null,null,null,null,null,null,null,null,null,null,null,null,null,null,null,null,null,null,null,null,null,null,null,null,null,null,null,null,{"$f":"IF(AI64<>\"\",COUNTA($AI$2:$AI64),\"\")","v":""},null,null,"Straßberger Martin","",null,"",null,0]
[null,null,null,null,null,null,null,null,null,null,null,null,null,null,null,null,null,null,null,null,null,null,null,null,null,null,null,null,null,null,null,null,null,{"$f":"IF(AI65<>\"\",COUNTA($AI$2:$AI65),\"\")","v":""},null,null,"Straßburger Marko","","ok","",null,0]
[null,null,null,null,null,null,null,null,null,null,null,null,null,null,null,null,null,null,null,null,null,null,null,null,null,null,null,null,null,null,null,null,null,{"$f":"IF(AI66<>\"\",COUNTA($AI$2:$AI66),\"\")","v":""},null,null,"Suttner Magnus",{"$f":"IFERROR(IF(AI66=\"\",\"\",IF(AJ66=\"gesetzt\",RAND()*5000000,RAND()*1000*20)),\"\")","v":""},"ok","",null,0]
[null,null,null,null,null,null,null,null,null,null,null,null,null,null,null,null,null,null,null,null,null,null,null,null,null,null,null,null,null,null,null,null,null,{"$f":"IF(AI67<>\"\",COUNTA($AI$2:$AI67),\"\")","v":""},null,null,"Thomas Moritz","",null,{"$f":"IF(AJ67=\"\",\"\",AJ67)","v":""},null,{"$f":"IF(AN67=\"gesetzt\",1,0)","v":0}]
[null,null,null,null,null,null,null,null,null,null,null,null,null,null,null,null,null,null,null,null,null,null,null,null,null,null,null,null,null,null,null,null,null,{"$f":"IF(AI68<>\"\",COUNTA($AI$2:$AI68),\"\")","v":""},null,null,"Valderrama Salvador","",null,"",null,0]
[null,null,null,null,null,null,null,null,null,null,null,null,null,null,null,null,null,null,null,null,null,null,null,null,null,null,null,null,null,null,null,null,null,{"$f":"IF(AI69<>\"\",COUNTA($AI$2:$AI69),\"\")","v":""},null,null,"Veit Timo","",null,"",null,0]
[null,null,null,null,null,null,null,null,null,null,null,null,null,null,null,null,null,null,null,null,null,null,null,null,null,null,null,null,null,null,null,null,null,{"$f":"IF(AI70<>\"\",COUNTA($AI$2:$AI70),\"\")","v":""},null,null,"Wagner Rene","","ok","",null,0]
[null,null,null,null,null,null,null,null,null,null,null,null,null,null,null,null,null,null,null,null,null,null,null,null,null,null,null,null,null,null,null,null,null,{"$f":"IF(AI71<>\"\",COUNTA($AI$2:$AI71),\"\")","v":""},null,null,"Weber Marco","","ok","",null,0]
[null,null,null,null,null,null,null,null,null,null,null,null,null,null,null,null,null,null,null,null,null,null,null,null,null,null,null,null,null,null,null,null,null,{"$f":"IF(AI72<>\"\",COUNTA($AI$2:$AI72),\"\")","v":""},null,null,"Witzik Oliver","",null,"",null,0]
[null,null,null,null,null,null,null,null,null,null,null,null,null,null,null,null,null,null,null,null,null,null,null,null,null,null,null,null,null,null,null,null,null,{"$f":"IF(AI73<>\"\",COUNTA($AI$2:$AI73),\"\")","v":""},null,null,"Wünsche Marco","","ok","",null,0]
[null,null,null,null,null,null,null,null,null,null,null,null,null,null,null,null,null,null,null,null,null,null,null,null,null,null,null,null,null,null,null,null,null,{"$f":"IF(AI74<>\"\",COUNTA($AI$2:$AI74),\"\")","v":""},null,null,"x","",null,"",null,0]
[null,null,null,null,null,null,null,null,null,null,null,null,null,null,null,null,null,null,null,null,null,null,null,null,null,null,null,null,null,null,null,null,null,{"$f":"IF(AI75<>\"\",COUNTA($AI$2:$AI75),\"\")","v":""},null,null,"y","",null,"",null,0]
[null,null,null,null,null,null,null,null,null,null,null,null,null,null,null,null,null,null,null,null,null,null,null,null,null,null,null,null,null,null,null,null,null,{"$f":"IF(AI76<>\"\",COUNTA($AI$2:$AI76),\"\")","v":""},null,null,"z","",null,"",null,0]
[null,null,null,null,null,null,null,null,null,null,null,null,null,null,null,null,null,null,null,null,null,null,null,null,null,null,null,null,null,null,null,null,null,{"$f":"IF(AI77<>\"\",COUNTA($AI$2:$AI77),\"\")","v":""},null,null,"Zimmermann Gerhard","",null,"",null,0]
[null,null,null,null,null,null,null,null,null,null,null,null,null,null,null,null,null,null,null,null,null,null,null,null,null,null,null,null,null,null,null,null,null,{"$f":"IF(AI78<>\"\",COUNTA($AI$2:$AI78),\"\")","v":""},null,null,null,"",null,"",null,0]
[null,null,null,null,null,null,null,null,null,null,null,null,null,null,null,null,null,null,null,null,null,null,null,null,null,null,null,null,null,null,null,null,null,{"$f":"IF(AI79<>\"\",COUNTA($AI$2:$AI79),\"\")","v":""},null,null,null,"",null,"",null,0]
[null,null,null,null,null,null,null,null,null,null,null,null,null,null,null,null,null,null,null,null,null,null,null,null,null,null,null,null,null,null,null,null,null,{"$f":"IF(AI80<>\"\",COUNTA($AI$2:$AI80),\"\")","v":""},null,null,null,"",null,"",null,0]
[null,null,null,null,null,null,null,null,null,null,null,null,null,null,null,null,null,null,null,null,null,null,null,null,null,null,null,null,null,null,null,null,null,{"$f":"IF(AI81<>\"\",COUNTA($AI$2:$AI81),\"\")","v":""},null,null,null,"",null,"",null,0]
[null,null,null,null,null,null,null,null,null,null,null,null,null,null,null,null,null,null,null,null,null,null,null,null,null,null,null,null,null,null,null,null,null,{"$f":"IF(AI82<>\"\",COUNTA($AI$2:$AI82),\"\")","v":""},null,null,null,"",null,"",null,0]
[null,null,null,null,null,null,null,null,null,null,null,null,null,null,null,null,null,null,null,null,null,null,null,null,null,null,null,null,null,null,null,null,null,{"$f":"IF(AI83<>\"\",COUNTA($AI$2:$AI83),\"\")","v":""},null,null,null,"",null,"",null,0]
[null,null,null,null,null,null,null,null,null,null,null,null,null,null,null,null,null,null,null,null,null,null,null,null,null,null,null,null,null,null,null,null,null,{"$f":"IF(AI84<>\"\",COUNTA($AI$2:$AI84),\"\")","v":""},null,null,null,"",null,"",null,0]
[null,null,null,null,null,null,null,null,null,null,null,null,null,null,null,null,null,null,null,null,null,null,null,null,null,null,null,null,null,null,null,null,null,{"$f":"IF(AI85<>\"\",COUNTA($AI$2:$AI85),\"\")","v":""},null,null,null,"",null,"",null,0]
[null,null,null,null,null,null,null,null,null,null,null,null,null,null,null,null,null,null,null,null,null,null,null,null,null,null,null,null,null,null,null,null,null,{"$f":"IF(AI86<>\"\",COUNTA($AI$2:$AI86),\"\")","v":""},null,null,null,"",null,"",null,0]
[null,null,null,null,null,null,null,null,null,null,null,null,null,null,null,null,null,null,null,null,null,null,null,null,null,null,null,null,null,null,null,null,null,{"$f":"IF(AI87<>\"\",COUNTA($AI$2:$AI87),\"\")","v":""},null,null,null,"",null,"",null,0]
[null,null,null,null,null,null,null,null,null,null,null,null,null,null,null,null,null,null,null,null,null,null,null,null,null,null,null,null,null,null,null,null,null,{"$f":"IF(AI88<>\"\",COUNTA($AI$2:$AI88),\"\")","v":""},null,null,null,"",null,"",null,0]
[null,null,null,null,null,null,null,null,null,null,null,null,null,null,null,null,null,null,null,null,null,null,null,null,null,null,null,null,null,null,null,null,null,{"$f":"IF(AI89<>\"\",COUNTA($AI$2:$AI89),\"\")","v":""},null,null,null,"",null,"",null,0]
[null,null,null,null,null,null,null,null,null,null,null,null,null,null,null,null,null,null,null,null,null,null,null,null,null,null,null,null,null,null,null,null,null,{"$f":"IF(AI90<>\"\",COUNTA($AI$2:$AI90),\"\")","v":""},null,null,null,"",null,"",null,0]
[null,null,null,null,null,null,null,null,null,null,null,null,null,null,null,null,null,null,null,null,null,null,null,null,null,null,null,null,null,null,null,null,null,{"$f":"IF(AI91<>\"\",COUNTA($AI$2:$AI91),\"\")","v":""},null,null,null,"",null,"",null,0]
[null,null,null,null,null,null,null,null,null,null,null,null,null,null,null,null,null,null,null,null,null,null,null,null,null,null,null,null,null,null,null,null,null,{"$f":"IF(AI92<>\"\",COUNTA($AI$2:$AI92),\"\")","v":""},null,null,null,"",null,"",null,0]
[null,null,null,null,null,null,null,null,null,null,null,null,null,null,null,null,null,null,null,null,null,null,null,null,null,null,null,null,null,null,null,null,null,{"$f":"IF(AI93<>\"\",COUNTA($AI$2:$AI93),\"\")","v":""},null,null,null,"",null,"",null,0]
[null,null,null,null,null,null,null,null,null,null,null,null,null,null,null,null,null,null,null,null,null,null,null,null,null,null,null,null,null,null,null,null,null,{"$f":"IF(AI94<>\"\",COUNTA($AI$2:$AI94),\"\")","v":""},null,null,null,"",null,"",null,0]
[null,null,null,null,null,null,null,null,null,null,null,null,null,null,null,null,null,null,null,null,null,null,null,null,null,null,null,null,null,null,null,null,null,{"$f":"IF(AI95<>\"\",COUNTA($AI$2:$AI95),\"\")","v":""},null,null,null,"",null,"",null,0]
[null,null,null,null,null,null,null,null,null,null,null,null,null,null,null,null,null,null,null,null,null,null,null,null,null,null,null,null,null,null,null,null,null,{"$f":"IF(AI96<>\"\",COUNTA($AI$2:$AI96),\"\")","v":""},null,null,null,"",null,"",null,0]
[null,null,null,null,null,null,null,null,null,null,null,null,null,null,null,null,null,null,null,null,null,null,null,null,null,null,null,null,null,null,null,null,null,{"$f":"IF(AI97<>\"\",COUNTA($AI$2:$AI97),\"\")","v":""},null,null,null,"",null,"",null,0]
[null,null,null,null,null,null,null,null,null,null,null,null,null,null,null,null,null,null,null,null,null,null,null,null,null,null,null,null,null,null,null,null,null,{"$f":"IF(AI98<>\"\",COUNTA($AI$2:$AI98),\"\")","v":""},null,null,null,"",null,"",null,0]
[null,null,null,null,null,null,null,null,null,null,null,null,null,null,null,null,null,null,null,null,null,null,null,null,null,null,null,null,null,null,null,null,null,{"$f":"IF(AI99<>\"\",COUNTA($AI$2:$AI99),\"\")","v":""},null,null,null,"",null,"",null,0]
[null,null,null,null,null,null,null,null,null,null,null,null,null,null,null,null,null,null,null,null,null,null,null,null,null,null,null,null,null,null,null,null,null,{"$f":"IF(AI100<>\"\",COUNTA($AI$2:$AI100),\"\")","v":""},null,null,null,"",null,"",null,0]
[null,null,null,null,null,null,null,null,null,null,null,null,null,null,null,null,null,null,null,null,null,null,null,null,null,null,null,null,null,null,null,null,null,{"$f":"IF(AI101<>\"\",COUNTA($AI$2:$AI101),\"\")","v":""},null,null,null,"",null,"",null,0]
[null,null,null,null,null,null,null,null,null,null,null,null,null,null,null,null,null,null,null,null,null,null,null,null,null,null,null,null,null,null,null,null,null,{"$f":"IF(AI102<>\"\",COUNTA($AI$2:$AI102),\"\")","v":""},null,null,null,"",null,"",null,0]
[null,null,null,null,null,null,null,null,null,null,null,null,null,null,null,null,null,null,null,null,null,null,null,null,null,null,null,null,null,null,null,null,null,{"$f":"IF(AI103<>\"\",COUNTA($AI$2:$AI103),\"\")","v":""},null,null,null,"",null,"",null,0]
[null,null,null,null,null,null,null,null,null,null,null,null,null,null,null,null,null,null,null,null,null,null,null,null,null,null,null,null,null,null,null,null,null,{"$f":"IF(AI104<>\"\",COUNTA($AI$2:$AI104),\"\")","v":""},null,null,null,"",null,"",null,0]
[null,null,null,null,null,null,null,null,null,null,null,null,null,null,null,null,null,null,null,null,null,null,null,null,null,null,null,null,null,null,null,null,null,{"$f":"IF(AI105<>\"\",COUNTA($AI$2:$AI105),\"\")","v":""},null,null,null,"",null,"",null,0]
[null,null,null,null,null,null,null,null,null,null,null,null,null,null,null,null,null,null,null,null,null,null,null,null,null,null,null,null,null,null,null,null,null,{"$f":"IF(AI106<>\"\",COUNTA($AI$2:$AI106),\"\")","v":""},null,null,null,"",null,"",null,0]
[null,null,null,null,null,null,null,null,null,null,null,null,null,null,null,null,null,null,null,null,null,null,null,null,null,null,null,null,null,null,null,null,null,{"$f":"IF(AI107<>\"\",COUNTA($AI$2:$AI107),\"\")","v":""},null,null,null,"",null,"",null,0]
[null,null,null,null,null,null,null,null,null,null,null,null,null,null,null,null,null,null,null,null,null,null,null,null,null,null,null,null,null,null,null,null,null,{"$f":"IF(AI108<>\"\",COUNTA($AI$2:$AI108),\"\")","v":""},null,null,null,"",null,"",null,0]
[null,null,null,null,null,null,null,null,null,null,null,null,null,null,null,null,null,null,null,null,null,null,null,null,null,null,null,null,null,null,null,null,null,{"$f":"IF(AI109<>\"\",COUNTA($AI$2:$AI109),\"\")","v":""},null,null,null,"",null,"",null,0]
[null,null,null,null,null,null,null,null,null,null,null,null,null,null,null,null,null,null,null,null,null,null,null,null,null,null,null,null,null,null,null,null,null,{"$f":"IF(AI110<>\"\",COUNTA($AI$2:$AI110),\"\")","v":""},null,null,null,"",null,"",null,0]
[null,null,null,null,null,null,null,null,null,null,null,null,null,null,null,null,null,null,null,null,null,null,null,null,null,null,null,null,null,null,null,null,null,{"$f":"IF(AI111<>\"\",COUNTA($AI$2:$AI111),\"\")","v":""},null,null,null,"",null,"",null,0]
[null,null,null,null,null,null,null,null,null,null,null,null,null,null,null,null,null,null,null,null,null,null,null,null,null,null,null,null,null,null,null,null,null,{"$f":"IF(AI112<>\"\",COUNTA($AI$2:$AI112),\"\")","v":""},null,null,null,"",null,"",null,0]
[null,null,null,null,null,null,null,null,null,null,null,null,null,null,null,null,null,null,null,null,null,null,null,null,null,null,null,null,null,null,null,null,null,{"$f":"IF(AI113<>\"\",COUNTA($AI$2:$AI113),\"\")","v":""},null,null,null,"",null,"",null,0]
[null,null,null,null,null,null,null,null,null,null,null,null,null,null,null,null,null,null,null,null,null,null,null,null,null,null,null,null,null,null,null,null,null,{"$f":"IF(AI114<>\"\",COUNTA($AI$2:$AI114),\"\")","v":""},null,null,null,"",null,"",null,0]
[null,null,null,null,null,null,null,null,null,null,null,null,null,null,null,null,null,null,null,null,null,null,null,null,null,null,null,null,null,null,null,null,null,{"$f":"IF(AI115<>\"\",COUNTA($AI$2:$AI115),\"\")","v":""},null,null,null,"",null,"",null,0]
[null,null,null,null,null,null,null,null,null,null,null,null,null,null,null,null,null,null,null,null,null,null,null,null,null,null,null,null,null,null,null,null,null,{"$f":"IF(AI116<>\"\",COUNTA($AI$2:$AI116),\"\")","v":""},null,null,null,"",null,"",null,0]
[null,null,null,null,null,null,null,null,null,null,null,null,null,null,null,null,null,null,null,null,null,null,null,null,null,null,null,null,null,null,null,null,null,{"$f":"IF(AI117<>\"\",COUNTA($AI$2:$AI117),\"\")","v":""},null,null,null,"",null,"",null,0]
[null,null,null,null,null,null,null,null,null,null,null,null,null,null,null,null,null,null,null,null,null,null,null,null,null,null,null,null,null,null,null,null,null,{"$f":"IF(AI118<>\"\",COUNTA($AI$2:$AI118),\"\")","v":""},null,null,null,"",null,"",null,0]
[null,null,null,null,null,null,null,null,null,null,null,null,null,null,null,null,null,null,null,null,null,null,null,null,null,null,null,null,null,null,null,null,null,{"$f":"IF(AI119<>\"\",COUNTA($AI$2:$AI119),\"\")","v":""},null,null,null,"",null,"",null,0]
[null,null,null,null,null,null,null,null,null,null,null,null,null,null,null,null,null,null,null,null,null,null,null,null,null,null,null,null,null,null,null,null,null,{"$f":"IF(AI120<>\"\",COUNTA($AI$2:$AI120),\"\")","v":""},null,null,null,"",null,"",null,0]
[null,null,null,null,null,null,null,null,null,null,null,null,null,null,null,null,null,null,null,null,null,null,null,null,null,null,null,null,null,null,null,null,null,{"$f":"IF(AI121<>\"\",COUNTA($AI$2:$AI121),\"\")","v":""},null,null,null,"",null,"",null,0]
[null,null,null,null,null,null,null,null,null,null,null,null,null,null,null,null,null,null,null,null,null,null,null,null,null,null,null,null,null,null,null,null,null,{"$f":"IF(AI122<>\"\",COUNTA($AI$2:$AI122),\"\")","v":""},null,null,null,"",null,"",null,0]
[null,null,null,null,null,null,null,null,null,null,null,null,null,null,null,null,null,null,null,null,null,null,null,null,null,null,null,null,null,null,null,null,null,{"$f":"IF(AI123<>\"\",COUNTA($AI$2:$AI123),\"\")","v":""},null,null,null,"",null,"",null,0]
[null,null,null,null,null,null,null,null,null,null,null,null,null,null,null,null,null,null,null,null,null,null,null,null,null,null,null,null,null,null,null,null,null,{"$f":"IF(AI124<>\"\",COUNTA($AI$2:$AI124),\"\")","v":""},null,null,null,"",null,"",null,0]
[null,null,null,null,null,null,null,null,null,null,null,null,null,null,null,null,null,null,null,null,null,null,null,null,null,null,null,null,null,null,null,null,null,{"$f":"IF(AI125<>\"\",COUNTA($AI$2:$AI125),\"\")","v":""},null,null,null,"",null,"",null,0]
[null,null,null,null,null,null,null,null,null,null,null,null,null,null,null,null,null,null,null,null,null,null,null,null,null,null,null,null,null,null,null,null,null,{"$f":"IF(AI126<>\"\",COUNTA($AI$2:$AI126),\"\")","v":""},null,null,null,"",null,"",null,0]
[null,null,null,null,null,null,null,null,null,null,null,null,null,null,null,null,null,null,null,null,null,null,null,null,null,null,null,null,null,null,null,null,null,{"$f":"IF(AI127<>\"\",COUNTA($AI$2:$AI127),\"\")","v":""},null,null,null,"",null,"",null,0]
[null,null,null,null,null,null,null,null,null,null,null,null,null,null,null,null,null,null,null,null,null,null,null,null,null,null,null,null,null,null,null,null,null,{"$f":"IF(AI128<>\"\",COUNTA($AI$2:$AI128),\"\")","v":""},null,null,null,"",null,"",null,0]
[null,null,null,null,null,null,null,null,null,null,null,null,null,null,null,null,null,null,null,null,null,null,null,null,null,null,null,null,null,null,null,null,null,{"$f":"IF(AI129<>\"\",COUNTA($AI$2:$AI129),\"\")","v":""},null,null,null,"",null,"",null,0]
[null,null,null,null,null,null,null,null,null,null,null,null,null,null,null,null,null,null,null,null,null,null,null,null,null,null,null,null,null,null,null,null,null,{"$f":"IF(AI130<>\"\",COUNTA($AI$2:$AI130),\"\")","v":""},null,null,null,{"$f":"IFERROR(IF(AI130=\"\",\"\",IF(AJ130=\"gesetzt\",RAND()*5000000,RAND()*1000*20)),\"\")","v":""},null,"",null,0]
[null,null,null,null,null,null,null,null,null,null,null,null,null,null,null,null,null,null,null,null,null,null,null,null,null,null,null,null,null,null,null,null,null,{"$f":"IF(AI131<>\"\",COUNTA($AI$2:$AI131),\"\")","v":""},null,null,null,"",null,{"$f":"IF(AJ131=\"\",\"\",AJ131)","v":""},null,{"$f":"IF(AN131=\"gesetzt\",1,0)","v":0}]
[null,null,null,null,null,null,null,null,null,null,null,null,null,null,null,null,null,null,null,null,null,null,null,null,null,null,null,null,null,null,null,null,null,{"$f":"IF(AI132<>\"\",COUNTA($AI$2:$AI132),\"\")","v":""},null,null,null,"",null,"",null,0]
[null,null,null,null,null,null,null,null,null,null,null,null,null,null,null,null,null,null,null,null,null,null,null,null,null,null,null,null,null,null,null,null,null,{"$f":"IF(AI133<>\"\",COUNTA($AI$2:$AI133),\"\")","v":""},null,null,null,"",null,"",null,0]
[null,null,null,null,null,null,null,null,null,null,null,null,null,null,null,null,null,null,null,null,null,null,null,null,null,null,null,null,null,null,null,null,null,{"$f":"IF(AI134<>\"\",COUNTA($AI$2:$AI134),\"\")","v":""},null,null,null,"",null,"",null,0]
[null,null,null,null,null,null,null,null,null,null,null,null,null,null,null,null,null,null,null,null,null,null,null,null,null,null,null,null,null,null,null,null,null,{"$f":"IF(AI135<>\"\",COUNTA($AI$2:$AI135),\"\")","v":""},null,null,null,"",null,"",null,0]
[null,null,null,null,null,null,null,null,null,null,null,null,null,null,null,null,null,null,null,null,null,null,null,null,null,null,null,null,null,null,null,null,null,{"$f":"IF(AI136<>\"\",COUNTA($AI$2:$AI136),\"\")","v":""},null,null,null,"",null,"",null,0]
[null,null,null,null,null,null,null,null,null,null,null,null,null,null,null,null,null,null,null,null,null,null,null,null,null,null,null,null,null,null,null,null,null,{"$f":"IF(AI137<>\"\",COUNTA($AI$2:$AI137),\"\")","v":""},null,null,null,"",null,"",null,0]
[null,null,null,null,null,null,null,null,null,null,null,null,null,null,null,null,null,null,null,null,null,null,null,null,null,null,null,null,null,null,null,null,null,{"$f":"IF(AI138<>\"\",COUNTA($AI$2:$AI138),\"\")","v":""},null,null,null,"",null,"",null,0]
[null,null,null,null,null,null,null,null,null,null,null,null,null,null,null,null,null,null,null,null,null,null,null,null,null,null,null,null,null,null,null,null,null,{"$f":"IF(AI139<>\"\",COUNTA($AI$2:$AI139),\"\")","v":""},null,null,null,"",null,"",null,0]
[null,null,null,null,null,null,null,null,null,null,null,null,null,null,null,null,null,null,null,null,null,null,null,null,null,null,null,null,null,null,null,null,null,{"$f":"IF(AI140<>\"\",COUNTA($AI$2:$AI140),\"\")","v":""},null,null,null,"",null,"",null,0]
[null,null,null,null,null,null,null,null,null,null,null,null,null,null,null,null,null,null,null,null,null,null,null,null,null,null,null,null,null,null,null,null,null,{"$f":"IF(AI141<>\"\",COUNTA($AI$2:$AI141),\"\")","v":""},null,null,null,"",null,"",null,0]
[null,null,null,null,null,null,null,null,null,null,null,null,null,null,null,null,null,null,null,null,null,null,null,null,null,null,null,null,null,null,null,null,null,{"$f":"IF(AI142<>\"\",COUNTA($AI$2:$AI142),\"\")","v":""},null,null,null,"",null,"",null,0]
[null,null,null,null,null,null,null,null,null,null,null,null,null,null,null,null,null,null,null,null,null,null,null,null,null,null,null,null,null,null,null,null,null,{"$f":"IF(AI143<>\"\",COUNTA($AI$2:$AI143),\"\")","v":""},null,null,null,"",null,"",null,0]
[null,null,null,null,null,null,null,null,null,null,null,null,null,null,null,null,null,null,null,null,null,null,null,null,null,null,null,null,null,null,null,null,null,{"$f":"IF(AI144<>\"\",COUNTA($AI$2:$AI144),\"\")","v":""},null,null,null,"",null,"",null,0]
[null,null,null,null,null,null,null,null,null,null,null,null,null,null,null,null,null,null,null,null,null,null,null,null,null,null,null,null,null,null,null,null,null,{"$f":"IF(AI145<>\"\",COUNTA($AI$2:$AI145),\"\")","v":""},null,null,null,"",null,"",null,0]
[null,null,null,null,null,null,null,null,null,null,null,null,null,null,null,null,null,null,null,null,null,null,null,null,null,null,null,null,null,null,null,null,null,{"$f":"IF(AI146<>\"\",COUNTA($AI$2:$AI146),\"\")","v":""},null,null,null,"",null,"",null,0]
[null,null,null,null,null,null,null,null,null,null,null,null,null,null,null,null,null,null,null,null,null,null,null,null,null,null,null,null,null,null,null,null,null,{"$f":"IF(AI147<>\"\",COUNTA($AI$2:$AI147),\"\")","v":""},null,null,null,"",null,"",null,0]
[null,null,null,null,null,null,null,null,null,null,null,null,null,null,null,null,null,null,null,null,null,null,null,null,null,null,null,null,null,null,null,null,null,{"$f":"IF(AI148<>\"\",COUNTA($AI$2:$AI148),\"\")","v":""},null,null,null,"",null,"",null,0]
[null,null,null,null,null,null,null,null,null,null,null,null,null,null,null,null,null,null,null,null,null,null,null,null,null,null,null,null,null,null,null,null,null,{"$f":"IF(AI149<>\"\",COUNTA($AI$2:$AI149),\"\")","v":""},null,null,null,"",null,"",null,0]
[null,null,null,null,null,null,null,null,null,null,null,null,null,null,null,null,null,null,null,null,null,null,null,null,null,null,null,null,null,null,null,null,null,{"$f":"IF(AI150<>\"\",COUNTA($AI$2:$AI150),\"\")","v":""},null,null,null,"",null,"",null,0]
[null,null,null,null,null,null,null,null,null,null,null,null,null,null,null,null,null,null,null,null,null,null,null,null,null,null,null,null,null,null,null,null,null,{"$f":"IF(AI151<>\"\",COUNTA($AI$2:$AI151),\"\")","v":""},null,null,null,"",null,"",null,0]
[null,null,null,null,null,null,null,null,null,null,null,null,null,null,null,null,null,null,null,null,null,null,null,null,null,null,null,null,null,null,null,null,null,{"$f":"IF(AI152<>\"\",COUNTA($AI$2:$AI152),\"\")","v":""},null,null,null,"",null,"",null,0]
[null,null,null,null,null,null,null,null,null,null,null,null,null,null,null,null,null,null,null,null,null,null,null,null,null,null,null,null,null,null,null,null,null,{"$f":"IF(AI153<>\"\",COUNTA($AI$2:$AI153),\"\")","v":""},null,null,null,"",null,"",null,0]
[null,null,null,null,null,null,null,null,null,null,null,null,null,null,null,null,null,null,null,null,null,null,null,null,null,null,null,null,null,null,null,null,null,{"$f":"IF(AI154<>\"\",COUNTA($AI$2:$AI154),\"\")","v":""},null,null,null,"",null,"",null,0]
[null,null,null,null,null,null,null,null,null,null,null,null,null,null,null,null,null,null,null,null,null,null,null,null,null,null,null,null,null,null,null,null,null,{"$f":"IF(AI155<>\"\",COUNTA($AI$2:$AI155),\"\")","v":""},null,null,null,"",null,"",null,0]
[null,null,null,null,null,null,null,null,null,null,null,null,null,null,null,null,null,null,null,null,null,null,null,null,null,null,null,null,null,null,null,null,null,{"$f":"IF(AI156<>\"\",COUNTA($AI$2:$AI156),\"\")","v":""},null,null,null,"",null,"",null,0]
[null,null,null,null,null,null,null,null,null,null,null,null,null,null,null,null,null,null,null,null,null,null,null,null,null,null,null,null,null,null,null,null,null,{"$f":"IF(AI157<>\"\",COUNTA($AI$2:$AI157),\"\")","v":""},null,null,null,"",null,"",null,0]
[null,null,null,null,null,null,null,null,null,null,null,null,null,null,null,null,null,null,null,null,null,null,null,null,null,null,null,null,null,null,null,null,null,{"$f":"IF(AI158<>\"\",COUNTA($AI$2:$AI158),\"\")","v":""},null,null,null,"",null,"",null,0]
[null,null,null,null,null,null,null,null,null,null,null,null,null,null,null,null,null,null,null,null,null,null,null,null,null,null,null,null,null,null,null,null,null,{"$f":"IF(AI159<>\"\",COUNTA($AI$2:$AI159),\"\")","v":""},null,null,null,"",null,"",null,0]
[null,null,null,null,null,null,null,null,null,null,null,null,null,null,null,null,null,null,null,null,null,null,null,null,null,null,null,null,null,null,null,null,null,{"$f":"IF(AI160<>\"\",COUNTA($AI$2:$AI160),\"\")","v":""},null,null,null,"",null,"",null,0]
[null,null,null,null,null,null,null,null,null,null,null,null,null,null,null,null,null,null,null,null,null,null,null,null,null,null,null,null,null,null,null,null,null,{"$f":"IF(AI161<>\"\",COUNTA($AI$2:$AI161),\"\")","v":""},null,null,null,"",null,"",null,0]
[null,null,null,null,null,null,null,null,null,null,null,null,null,null,null,null,null,null,null,null,null,null,null,null,null,null,null,null,null,null,null,null,null,{"$f":"IF(AI162<>\"\",COUNTA($AI$2:$AI162),\"\")","v":""},null,null,null,"",null,"",null,0]
[null,null,null,null,null,null,null,null,null,null,null,null,null,null,null,null,null,null,null,null,null,null,null,null,null,null,null,null,null,null,null,null,null,{"$f":"IF(AI163<>\"\",COUNTA($AI$2:$AI163),\"\")","v":""},null,null,null,"",null,"",null,0]
[null,null,null,null,null,null,null,null,null,null,null,null,null,null,null,null,null,null,null,null,null,null,null,null,null,null,null,null,null,null,null,null,null,{"$f":"IF(AI164<>\"\",COUNTA($AI$2:$AI164),\"\")","v":""},null,null,null,"",null,"",null,0]
[null,null,null,null,null,null,null,null,null,null,null,null,null,null,null,null,null,null,null,null,null,null,null,null,null,null,null,null,null,null,null,null,null,{"$f":"IF(AI165<>\"\",COUNTA($AI$2:$AI165),\"\")","v":""},null,null,null,"",null,"",null,0]
[null,null,null,null,null,null,null,null,null,null,null,null,null,null,null,null,null,null,null,null,null,null,null,null,null,null,null,null,null,null,null,null,null,{"$f":"IF(AI166<>\"\",COUNTA($AI$2:$AI166),\"\")","v":""},null,null,null,"",null,"",null,0]
[null,null,null,null,null,null,null,null,null,null,null,null,null,null,null,null,null,null,null,null,null,null,null,null,null,null,null,null,null,null,null,null,null,{"$f":"IF(AI167<>\"\",COUNTA($AI$2:$AI167),\"\")","v":""},null,null,null,"",null,"",null,0]
[null,null,null,null,null,null,null,null,null,null,null,null,null,null,null,null,null,null,null,null,null,null,null,null,null,null,null,null,null,null,null,null,null,{"$f":"IF(AI168<>\"\",COUNTA($AI$2:$AI168),\"\")","v":""},null,null,null,"",null,"",null,0]
[null,null,null,null,null,null,null,null,null,null,null,null,null,null,null,null,null,null,null,null,null,null,null,null,null,null,null,null,null,null,null,null,null,{"$f":"IF(AI169<>\"\",COUNTA($AI$2:$AI169),\"\")","v":""},null,null,null,"",null,"",null,0]
[null,null,null,null,null,null,null,null,null,null,null,null,null,null,null,null,null,null,null,null,null,null,null,null,null,null,null,null,null,null,null,null,null,{"$f":"IF(AI170<>\"\",COUNTA($AI$2:$AI170),\"\")","v":""},null,null,null,"",null,"",null,0]
[null,null,null,null,null,null,null,null,null,null,null,null,null,null,null,null,null,null,null,null,null,null,null,null,null,null,null,null,null,null,null,null,null,{"$f":"IF(AI171<>\"\",COUNTA($AI$2:$AI171),\"\")","v":""},null,null,null,"",null,"",null,0]
[null,null,null,null,null,null,null,null,null,null,null,null,null,null,null,null,null,null,null,null,null,null,null,null,null,null,null,null,null,null,null,null,null,{"$f":"IF(AI172<>\"\",COUNTA($AI$2:$AI172),\"\")","v":""},null,null,null,"",null,"",null,0]
[null,null,null,null,null,null,null,null,null,null,null,null,null,null,null,null,null,null,null,null,null,null,null,null,null,null,null,null,null,null,null,null,null,{"$f":"IF(AI173<>\"\",COUNTA($AI$2:$AI173),\"\")","v":""},null,null,null,"",null,"",null,0]
[null,null,null,null,null,null,null,null,null,null,null,null,null,null,null,null,null,null,null,null,null,null,null,null,null,null,null,null,null,null,null,null,null,{"$f":"IF(AI174<>\"\",COUNTA($AI$2:$AI174),\"\")","v":""},null,null,null,"",null,"",null,0]
[null,null,null,null,null,null,null,null,null,null,null,null,null,null,null,null,null,null,null,null,null,null,null,null,null,null,null,null,null,null,null,null,null,{"$f":"IF(AI175<>\"\",COUNTA($AI$2:$AI175),\"\")","v":""},null,null,null,"",null,"",null,0]
[null,null,null,null,null,null,null,null,null,null,null,null,null,null,null,null,null,null,null,null,null,null,null,null,null,null,null,null,null,null,null,null,null,{"$f":"IF(AI176<>\"\",COUNTA($AI$2:$AI176),\"\")","v":""},null,null,null,"",null,"",null,0]
[null,null,null,null,null,null,null,null,null,null,null,null,null,null,null,null,null,null,null,null,null,null,null,null,null,null,null,null,null,null,null,null,null,{"$f":"IF(AI177<>\"\",COUNTA($AI$2:$AI177),\"\")","v":""},null,null,null,"",null,"",null,0]
[null,null,null,null,null,null,null,null,null,null,null,null,null,null,null,null,null,null,null,null,null,null,null,null,null,null,null,null,null,null,null,null,null,{"$f":"IF(AI178<>\"\",COUNTA($AI$2:$AI178),\"\")","v":""},null,null,null,"",null,"",null,0]
[null,null,null,null,null,null,null,null,null,null,null,null,null,null,null,null,null,null,null,null,null,null,null,null,null,null,null,null,null,null,null,null,null,{"$f":"IF(AI179<>\"\",COUNTA($AI$2:$AI179),\"\")","v":""},null,null,null,"",null,"",null,0]
[null,null,null,null,null,null,null,null,null,null,null,null,null,null,null,null,null,null,null,null,null,null,null,null,null,null,null,null,null,null,null,null,null,{"$f":"IF(AI180<>\"\",COUNTA($AI$2:$AI180),\"\")","v":""},null,null,null,"",null,"",null,0]
[null,null,null,null,null,null,null,null,null,null,null,null,null,null,null,null,null,null,null,null,null,null,null,null,null,null,null,null,null,null,null,null,null,{"$f":"IF(AI181<>\"\",COUNTA($AI$2:$AI181),\"\")","v":""},null,null,null,"",null,"",null,0]
[null,null,null,null,null,null,null,null,null,null,null,null,null,null,null,null,null,null,null,null,null,null,null,null,null,null,null,null,null,null,null,null,null,{"$f":"IF(AI182<>\"\",COUNTA($AI$2:$AI182),\"\")","v":""},null,null,null,"",null,"",null,0]
[null,null,null,null,null,null,null,null,null,null,null,null,null,null,null,null,null,null,null,null,null,null,null,null,null,null,null,null,null,null,null,null,null,{"$f":"IF(AI183<>\"\",COUNTA($AI$2:$AI183),\"\")","v":""},null,null,null,"",null,"",null,0]
[null,null,null,null,null,null,null,null,null,null,null,null,null,null,null,null,null,null,null,null,null,null,null,null,null,null,null,null,null,null,null,null,null,{"$f":"IF(AI184<>\"\",COUNTA($AI$2:$AI184),\"\")","v":""},null,null,null,"",null,"",null,0]
[null,null,null,null,null,null,null,null,null,null,null,null,null,null,null,null,null,null,null,null,null,null,null,null,null,null,null,null,null,null,null,null,null,{"$f":"IF(AI185<>\"\",COUNTA($AI$2:$AI185),\"\")","v":""},null,null,null,"",null,"",null,0]
[null,null,null,null,null,null,null,null,null,null,null,null,null,null,null,null,null,null,null,null,null,null,null,null,null,null,null,null,null,null,null,null,null,{"$f":"IF(AI186<>\"\",COUNTA($AI$2:$AI186),\"\")","v":""},null,null,null,"",null,"",null,0]
[null,null,null,null,null,null,null,null,null,null,null,null,null,null,null,null,null,null,null,null,null,null,null,null,null,null,null,null,null,null,null,null,null,{"$f":"IF(AI187<>\"\",COUNTA($AI$2:$AI187),\"\")","v":""},null,null,null,"",null,"",null,0]
[null,null,null,null,null,null,null,null,null,null,null,null,null,null,null,null,null,null,null,null,null,null,null,null,null,null,null,null,null,null,null,null,null,{"$f":"IF(AI188<>\"\",COUNTA($AI$2:$AI188),\"\")","v":""},null,null,null,"",null,"",null,0]
[null,null,null,null,null,null,null,null,null,null,null,null,null,null,null,null,null,null,null,null,null,null,null,null,null,null,null,null,null,null,null,null,null,{"$f":"IF(AI189<>\"\",COUNTA($AI$2:$AI189),\"\")","v":""},null,null,null,"",null,"",null,0]
[null,null,null,null,null,null,null,null,null,null,null,null,null,null,null,null,null,null,null,null,null,null,null,null,null,null,null,null,null,null,null,null,null,{"$f":"IF(AI190<>\"\",COUNTA($AI$2:$AI190),\"\")","v":""},null,null,null,"",null,"",null,0]
[null,null,null,null,null,null,null,null,null,null,null,null,null,null,null,null,null,null,null,null,null,null,null,null,null,null,null,null,null,null,null,null,null,{"$f":"IF(AI191<>\"\",COUNTA($AI$2:$AI191),\"\")","v":""},null,null,null,"",null,"",null,0]
[null,null,null,null,null,null,null,null,null,null,null,null,null,null,null,null,null,null,null,null,null,null,null,null,null,null,null,null,null,null,null,null,null,{"$f":"IF(AI192<>\"\",COUNTA($AI$2:$AI192),\"\")","v":""},null,null,null,"",null,"",null,0]
[null,null,null,null,null,null,null,null,null,null,null,null,null,null,null,null,null,null,null,null,null,null,null,null,null,null,null,null,null,null,null,null,null,{"$f":"IF(AI193<>\"\",COUNTA($AI$2:$AI193),\"\")","v":""},null,null,null,"",null,"",null,0]
[null,null,null,null,null,null,null,null,null,null,null,null,null,null,null,null,null,null,null,null,null,null,null,null,null,null,null,null,null,null,null,null,null,{"$f":"IF(AI194<>\"\",COUNTA($AI$2:$AI194),\"\")","v":""},null,null,null,{"$f":"IFERROR(IF(AI194=\"\",\"\",IF(AJ194=\"gesetzt\",RAND()*5000000,RAND()*1000*20)),\"\")","v":""},null,"",null,0]
[null,null,null,null,null,null,null,null,null,null,null,null,null,null,null,null,null,null,null,null,null,null,null,null,null,null,null,null,null,null,null,null,null,{"$f":"IF(AI195<>\"\",COUNTA($AI$2:$AI195),\"\")","v":""},null,null,null,"",null,{"$f":"IF(AJ195=\"\",\"\",AJ195)","v":""},null,{"$f":"IF(AN195=\"gesetzt\",1,0)","v":0}]
[null,null,null,null,null,null,null,null,null,null,null,null,null,null,null,null,null,null,null,null,null,null,null,null,null,null,null,null,null,null,null,null,null,{"$f":"IF(AI196<>\"\",COUNTA($AI$2:$AI196),\"\")","v":""},null,null,null,"",null,"",null,0]
[null,null,null,null,null,null,null,null,null,null,null,null,null,null,null,null,null,null,null,null,null,null,null,null,null,null,null,null,null,null,null,null,null,{"$f":"IF(AI197<>\"\",COUNTA($AI$2:$AI197),\"\")","v":""},null,null,null,"",null,"",null,0]
[null,null,null,null,null,null,null,null,null,null,null,null,null,null,null,null,null,null,null,null,null,null,null,null,null,null,null,null,null,null,null,null,null,{"$f":"IF(AI198<>\"\",COUNTA($AI$2:$AI198),\"\")","v":""},null,null,null,"",null,"",null,0]
[null,null,null,null,null,null,null,null,null,null,null,null,null,null,null,null,null,null,null,null,null,null,null,null,null,null,null,null,null,null,null,null,null,{"$f":"IF(AI199<>\"\",COUNTA($AI$2:$AI199),\"\")","v":""},null,null,null,"",null,"",null,0]
[null,null,null,null,null,null,null,null,null,null,null,null,null,null,null,null,null,null,null,null,null,null,null,null,null,null,null,null,null,null,null,null,null,{"$f":"IF(AI200<>\"\",COUNTA($AI$2:$AI200),\"\")","v":""},null,null,null,"",null,"",null,0]
[null,null,null,null,null,null,null,null,null,null,null,null,null,null,null,null,null,null,null,null,null,null,null,null,null,null,null,null,null,null,null,null,null,{"$f":"IF(AI201<>\"\",COUNTA($AI$2:$AI201),\"\")","v":""},null,null,null,"",null,"",null,0]
[null,null,null,null,null,null,null,null,null,null,null,null,null,null,null,null,null,null,null,null,null,null,null,null,null,null,null,null,null,null,null,null,null,{"$f":"IF(AI202<>\"\",COUNTA($AI$2:$AI202),\"\")","v":""},null,null,null,"",null,"",null,0]
[null,null,null,null,null,null,null,null,null,null,null,null,null,null,null,null,null,null,null,null,null,null,null,null,null,null,null,null,null,null,null,null,null,{"$f":"IF(AI203<>\"\",COUNTA($AI$2:$AI203),\"\")","v":""},null,null,null,"",null,"",null,0]
[null,null,null,null,null,null,null,null,null,null,null,null,null,null,null,null,null,null,null,null,null,null,null,null,null,null,null,null,null,null,null,null,null,{"$f":"IF(AI204<>\"\",COUNTA($AI$2:$AI204),\"\")","v":""},null,null,null,"",null,"",null,0]
[null,null,null,null,null,null,null,null,null,null,null,null,null,null,null,null,null,null,null,null,null,null,null,null,null,null,null,null,null,null,null,null,null,{"$f":"IF(AI205<>\"\",COUNTA($AI$2:$AI205),\"\")","v":""},null,null,null,"",null,"",null,0]
[null,null,null,null,null,null,null,null,null,null,null,null,null,null,null,null,null,null,null,null,null,null,null,null,null,null,null,null,null,null,null,null,null,{"$f":"IF(AI206<>\"\",COUNTA($AI$2:$AI206),\"\")","v":""},null,null,null,"",null,"",null,0]
[null,null,null,null,null,null,null,null,null,null,null,null,null,null,null,null,null,null,null,null,null,null,null,null,null,null,null,null,null,null,null,null,null,{"$f":"IF(AI207<>\"\",COUNTA($AI$2:$AI207),\"\")","v":""},null,null,null,"",null,"",null,0]
[null,null,null,null,null,null,null,null,null,null,null,null,null,null,null,null,null,null,null,null,null,null,null,null,null,null,null,null,null,null,null,null,null,{"$f":"IF(AI208<>\"\",COUNTA($AI$2:$AI208),\"\")","v":""},null,null,null,"",null,"",null,0]
[null,null,null,null,null,null,null,null,null,null,null,null,null,null,null,null,null,null,null,null,null,null,null,null,null,null,null,null,null,null,null,null,null,{"$f":"IF(AI209<>\"\",COUNTA($AI$2:$AI209),\"\")","v":""},null,null,null,"",null,"",null,0]
[null,null,null,null,null,null,null,null,null,null,null,null,null,null,null,null,null,null,null,null,null,null,null,null,null,null,null,null,null,null,null,null,null,{"$f":"IF(AI210<>\"\",COUNTA($AI$2:$AI210),\"\")","v":""},null,null,null,"",null,"",null,0]
[null,null,null,null,null,null,null,null,null,null,null,null,null,null,null,null,null,null,null,null,null,null,null,null,null,null,null,null,null,null,null,null,null,{"$f":"IF(AI211<>\"\",COUNTA($AI$2:$AI211),\"\")","v":""},null,null,null,"",null,"",null,0]
[null,null,null,null,null,null,null,null,null,null,null,null,null,null,null,null,null,null,null,null,null,null,null,null,null,null,null,null,null,null,null,null,null,{"$f":"IF(AI212<>\"\",COUNTA($AI$2:$AI212),\"\")","v":""},null,null,null,"",null,"",null,0]
[null,null,null,null,null,null,null,null,null,null,null,null,null,null,null,null,null,null,null,null,null,null,null,null,null,null,null,null,null,null,null,null,null,{"$f":"IF(AI213<>\"\",COUNTA($AI$2:$AI213),\"\")","v":""},null,null,null,"",null,"",null,0]
[null,null,null,null,null,null,null,null,null,null,null,null,null,null,null,null,null,null,null,null,null,null,null,null,null,null,null,null,null,null,null,null,null,{"$f":"IF(AI214<>\"\",COUNTA($AI$2:$AI214),\"\")","v":""},null,null,null,"",null,"",null,0]
[null,null,null,null,null,null,null,null,null,null,null,null,null,null,null,null,null,null,null,null,null,null,null,null,null,null,null,null,null,null,null,null,null,{"$f":"IF(AI215<>\"\",COUNTA($AI$2:$AI215),\"\")","v":""},null,null,null,"",null,"",null,0]
[null,null,null,null,null,null,null,null,null,null,null,null,null,null,null,null,null,null,null,null,null,null,null,null,null,null,null,null,null,null,null,null,null,{"$f":"IF(AI216<>\"\",COUNTA($AI$2:$AI216),\"\")","v":""},null,null,null,"",null,"",null,0]
[null,null,null,null,null,null,null,null,null,null,null,null,null,null,null,null,null,null,null,null,null,null,null,null,null,null,null,null,null,null,null,null,null,{"$f":"IF(AI217<>\"\",COUNTA($AI$2:$AI217),\"\")","v":""},null,null,null,"",null,"",null,0]
[null,null,null,null,null,null,null,null,null,null,null,null,null,null,null,null,null,null,null,null,null,null,null,null,null,null,null,null,null,null,null,null,null,{"$f":"IF(AI218<>\"\",COUNTA($AI$2:$AI218),\"\")","v":""},null,null,null,"",null,"",null,0]
[null,null,null,null,null,null,null,null,null,null,null,null,null,null,null,null,null,null,null,null,null,null,null,null,null,null,null,null,null,null,null,null,null,{"$f":"IF(AI219<>\"\",COUNTA($AI$2:$AI219),\"\")","v":""},null,null,null,"",null,"",null,0]
[null,null,null,null,null,null,null,null,null,null,null,null,null,null,null,null,null,null,null,null,null,null,null,null,null,null,null,null,null,null,null,null,null,{"$f":"IF(AI220<>\"\",COUNTA($AI$2:$AI220),\"\")","v":""},null,null,null,"",null,"",null,0]
[null,null,null,null,null,null,null,null,null,null,null,null,null,null,null,null,null,null,null,null,null,null,null,null,null,null,null,null,null,null,null,null,null,{"$f":"IF(AI221<>\"\",COUNTA($AI$2:$AI221),\"\")","v":""},null,null,null,"",null,"",null,0]
[null,null,null,null,null,null,null,null,null,null,null,null,null,null,null,null,null,null,null,null,null,null,null,null,null,null,null,null,null,null,null,null,null,{"$f":"IF(AI222<>\"\",COUNTA($AI$2:$AI222),\"\")","v":""},null,null,null,"",null,"",null,0]
[null,null,null,null,null,null,null,null,null,null,null,null,null,null,null,null,null,null,null,null,null,null,null,null,null,null,null,null,null,null,null,null,null,{"$f":"IF(AI223<>\"\",COUNTA($AI$2:$AI223),\"\")","v":""},null,null,null,"",null,"",null,0]
[null,null,null,null,null,null,null,null,null,null,null,null,null,null,null,null,null,null,null,null,null,null,null,null,null,null,null,null,null,null,null,null,null,{"$f":"IF(AI224<>\"\",COUNTA($AI$2:$AI224),\"\")","v":""},null,null,null,"",null,"",null,0]
[null,null,null,null,null,null,null,null,null,null,null,null,null,null,null,null,null,null,null,null,null,null,null,null,null,null,null,null,null,null,null,null,null,{"$f":"IF(AI225<>\"\",COUNTA($AI$2:$AI225),\"\")","v":""},null,null,null,"",null,"",null,0]
[null,null,null,null,null,null,null,null,null,null,null,null,null,null,null,null,null,null,null,null,null,null,null,null,null,null,null,null,null,null,null,null,null,{"$f":"IF(AI226<>\"\",COUNTA($AI$2:$AI226),\"\")","v":""},null,null,null,"",null,"",null,0]
[null,null,null,null,null,null,null,null,null,null,null,null,null,null,null,null,null,null,null,null,null,null,null,null,null,null,null,null,null,null,null,null,null,{"$f":"IF(AI227<>\"\",COUNTA($AI$2:$AI227),\"\")","v":""},null,null,null,"",null,"",null,0]
[null,null,null,null,null,null,null,null,null,null,null,null,null,null,null,null,null,null,null,null,null,null,null,null,null,null,null,null,null,null,null,null,null,{"$f":"IF(AI228<>\"\",COUNTA($AI$2:$AI228),\"\")","v":""},null,null,null,"",null,"",null,0]
[null,null,null,null,null,null,null,null,null,null,null,null,null,null,null,null,null,null,null,null,null,null,null,null,null,null,null,null,null,null,null,null,null,{"$f":"IF(AI229<>\"\",COUNTA($AI$2:$AI229),\"\")","v":""},null,null,null,"",null,"",null,0]
[null,null,null,null,null,null,null,null,null,null,null,null,null,null,null,null,null,null,null,null,null,null,null,null,null,null,null,null,null,null,null,null,null,{"$f":"IF(AI230<>\"\",COUNTA($AI$2:$AI230),\"\")","v":""},null,null,null,"",null,"",null,0]
[null,null,null,null,null,null,null,null,null,null,null,null,null,null,null,null,null,null,null,null,null,null,null,null,null,null,null,null,null,null,null,null,null,{"$f":"IF(AI231<>\"\",COUNTA($AI$2:$AI231),\"\")","v":""},null,null,null,"",null,"",null,0]
[null,null,null,null,null,null,null,null,null,null,null,null,null,null,null,null,null,null,null,null,null,null,null,null,null,null,null,null,null,null,null,null,null,{"$f":"IF(AI232<>\"\",COUNTA($AI$2:$AI232),\"\")","v":""},null,null,null,"",null,"",null,0]
[null,null,null,null,null,null,null,null,null,null,null,null,null,null,null,null,null,null,null,null,null,null,null,null,null,null,null,null,null,null,null,null,null,{"$f":"IF(AI233<>\"\",COUNTA($AI$2:$AI233),\"\")","v":""},null,null,null,"",null,"",null,0]
[null,null,null,null,null,null,null,null,null,null,null,null,null,null,null,null,null,null,null,null,null,null,null,null,null,null,null,null,null,null,null,null,null,{"$f":"IF(AI234<>\"\",COUNTA($AI$2:$AI234),\"\")","v":""},null,null,null,"",null,"",null,0]
[null,null,null,null,null,null,null,null,null,null,null,null,null,null,null,null,null,null,null,null,null,null,null,null,null,null,null,null,null,null,null,null,null,{"$f":"IF(AI235<>\"\",COUNTA($AI$2:$AI235),\"\")","v":""},null,null,null,"",null,"",null,0]
[null,null,null,null,null,null,null,null,null,null,null,null,null,null,null,null,null,null,null,null,null,null,null,null,null,null,null,null,null,null,null,null,null,{"$f":"IF(AI236<>\"\",COUNTA($AI$2:$AI236),\"\")","v":""},null,null,null,"",null,"",null,0]
[null,null,null,null,null,null,null,null,null,null,null,null,null,null,null,null,null,null,null,null,null,null,null,null,null,null,null,null,null,null,null,null,null,{"$f":"IF(AI237<>\"\",COUNTA($AI$2:$AI237),\"\")","v":""},null,null,null,"",null,"",null,0]
[null,null,null,null,null,null,null,null,null,null,null,null,null,null,null,null,null,null,null,null,null,null,null,null,null,null,null,null,null,null,null,null,null,{"$f":"IF(AI238<>\"\",COUNTA($AI$2:$AI238),\"\")","v":""},null,null,null,"",null,"",null,0]
[null,null,null,null,null,null,null,null,null,null,null,null,null,null,null,null,null,null,null,null,null,null,null,null,null,null,null,null,null,null,null,null,null,{"$f":"IF(AI239<>\"\",COUNTA($AI$2:$AI239),\"\")","v":""},null,null,null,"",null,"",null,0]
[null,null,null,null,null,null,null,null,null,null,null,null,null,null,null,null,null,null,null,null,null,null,null,null,null,null,null,null,null,null,null,null,null,{"$f":"IF(AI240<>\"\",COUNTA($AI$2:$AI240),\"\")","v":""},null,null,null,"",null,"",null,0]
[null,null,null,null,null,null,null,null,null,null,null,null,null,null,null,null,null,null,null,null,null,null,null,null,null,null,null,null,null,null,null,null,null,{"$f":"IF(AI241<>\"\",COUNTA($AI$2:$AI241),\"\")","v":""},null,null,null,"",null,"",null,0]
[null,null,null,null,null,null,null,null,null,null,null,null,null,null,null,null,null,null,null,null,null,null,null,null,null,null,null,null,null,null,null,null,null,{"$f":"IF(AI242<>\"\",COUNTA($AI$2:$AI242),\"\")","v":""},null,null,null,"",null,"",null,0]
[null,null,null,null,null,null,null,null,null,null,null,null,null,null,null,null,null,null,null,null,null,null,null,null,null,null,null,null,null,null,null,null,null,{"$f":"IF(AI243<>\"\",COUNTA($AI$2:$AI243),\"\")","v":""},null,null,null,"",null,"",null,0]
[null,null,null,null,null,null,null,null,null,null,null,null,null,null,null,null,null,null,null,null,null,null,null,null,null,null,null,null,null,null,null,null,null,{"$f":"IF(AI244<>\"\",COUNTA($AI$2:$AI244),\"\")","v":""},null,null,null,"",null,"",null,0]
[null,null,null,null,null,null,null,null,null,null,null,null,null,null,null,null,null,null,null,null,null,null,null,null,null,null,null,null,null,null,null,null,null,{"$f":"IF(AI245<>\"\",COUNTA($AI$2:$AI245),\"\")","v":""},null,null,null,"",null,"",null,0]
[null,null,null,null,null,null,null,null,null,null,null,null,null,null,null,null,null,null,null,null,null,null,null,null,null,null,null,null,null,null,null,null,null,{"$f":"IF(AI246<>\"\",COUNTA($AI$2:$AI246),\"\")","v":""},null,null,null,"",null,"",null,0]
[null,null,null,null,null,null,null,null,null,null,null,null,null,null,null,null,null,null,null,null,null,null,null,null,null,null,null,null,null,null,null,null,null,{"$f":"IF(AI247<>\"\",COUNTA($AI$2:$AI247),\"\")","v":""},null,null,null,"",null,"",null,0]
[null,null,null,null,null,null,null,null,null,null,null,null,null,null,null,null,null,null,null,null,null,null,null,null,null,null,null,null,null,null,null,null,null,{"$f":"IF(AI248<>\"\",COUNTA($AI$2:$AI248),\"\")","v":""},null,null,null,"",null,"",null,0]
[null,null,null,null,null,null,null,null,null,null,null,null,null,null,null,null,null,null,null,null,null,null,null,null,null,null,null,null,null,null,null,null,null,{"$f":"IF(AI249<>\"\",COUNTA($AI$2:$AI249),\"\")","v":""},null,null,null,"",null,"",null,0]
[null,null,null,null,null,null,null,null,null,null,null,null,null,null,null,null,null,null,null,null,null,null,null,null,null,null,null,null,null,null,null,null,null,{"$f":"IF(AI250<>\"\",COUNTA($AI$2:$AI250),\"\")","v":""},null,null,null,"",null,"",null,0]
[null,null,null,null,null,null,null,null,null,null,null,null,null,null,null,null,null,null,null,null,null,null,null,null,null,null,null,null,null,null,null,null,null,{"$f":"IF(AI251<>\"\",COUNTA($AI$2:$AI251),\"\")","v":""},null,null,null,"",null,"",null,0]
[null,null,null,null,null,null,null,null,null,null,null,null,null,null,null,null,null,null,null,null,null,null,null,null,null,null,null,null,null,null,null,null,null,{"$f":"IF(AI252<>\"\",COUNTA($AI$2:$AI252),\"\")","v":""},null,null,null,"",null,"",null,0]
[null,null,null,null,null,null,null,null,null,null,null,null,null,null,null,null,null,null,null,null,null,null,null,null,null,null,null,null,null,null,null,null,null,{"$f":"IF(AI253<>\"\",COUNTA($AI$2:$AI253),\"\")","v":""},null,null,null,"",null,"",null,0]
[null,null,null,null,null,null,null,null,null,null,null,null,null,null,null,null,null,null,null,null,null,null,null,null,null,null,null,null,null,null,null,null,null,{"$f":"IF(AI254<>\"\",COUNTA($AI$2:$AI254),\"\")","v":""},null,null,null,"",null,"",null,0]
[null,null,null,null,null,null,null,null,null,null,null,null,null,null,null,null,null,null,null,null,null,null,null,null,null,null,null,null,null,null,null,null,null,{"$f":"IF(AI255<>\"\",COUNTA($AI$2:$AI255),\"\")","v":""},null,null,null,"",null,"",null,0]
[null,null,null,null,null,null,null,null,null,null,null,null,null,null,null,null,null,null,null,null,null,null,null,null,null,null,null,null,null,null,null,null,null,{"$f":"IF(AI256<>\"\",COUNTA($AI$2:$AI256),\"\")","v":""},null,null,null,"",null,"",null,0]
[null,null,null,null,null,null,null,null,null,null,null,null,null,null,null,null,null,null,null,null,null,null,null,null,null,null,null,null,null,null,null,null,null,{"$f":"IF(AI257<>\"\",COUNTA($AI$2:$AI257),\"\")","v":""},null,null,null,"",null,"",null,0]
[null,null,null,null,null,null,null,null,null,null,null,null,null,null,null,null,null,null,null,null,null,null,null,null,null,null,null,null,null,null,null,null,null,{"$f":"IF(AI258<>\"\",COUNTA($AI$2:$AI258),\"\")","v":""},null,null,null,{"$f":"IFERROR(IF(AI258=\"\",\"\",IF(AJ258=\"gesetzt\",RAND()*5000000,RAND()*1000*20)),\"\")","v":""},null,"",null,0]
[null,null,null,null,null,null,null,null,null,null,null,null,null,null,null,null,null,null,null,null,null,null,null,null,null,null,null,null,null,null,null,null,null,{"$f":"IF(AI259<>\"\",COUNTA($AI$2:$AI259),\"\")","v":""},null,null,null,"",null,{"$f":"IF(AJ259=\"\",\"\",AJ259)","v":""},null,{"$f":"IF(AN259=\"gesetzt\",1,0)","v":0}]
[null,null,null,null,null,null,null,null,null,null,null,null,null,null,null,null,null,null,null,null,null,null,null,null,null,null,null,null,null,null,null,null,null,{"$f":"IF(AI260<>\"\",COUNTA($AI$2:$AI260),\"\")","v":""},null,null,null,"",null,"",null,0]
[null,null,null,null,null,null,null,null,null,null,null,null,null,null,null,null,null,null,null,null,null,null,null,null,null,null,null,null,null,null,null,null,null,{"$f":"IF(AI261<>\"\",COUNTA($AI$2:$AI261),\"\")","v":""},null,null,null,"",null,"",null,0]
[null,null,null,null,null,null,null,null,null,null,null,null,null,null,null,null,null,null,null,null,null,null,null,null,null,null,null,null,null,null,null,null,null,{"$f":"IF(AI262<>\"\",COUNTA($AI$2:$AI262),\"\")","v":""},null,null,null,"",null,"",null,0]
[null,null,null,null,null,null,null,null,null,null,null,null,null,null,null,null,null,null,null,null,null,null,null,null,null,null,null,null,null,null,null,null,null,{"$f":"IF(AI263<>\"\",COUNTA($AI$2:$AI263),\"\")","v":""},null,null,null,"",null,"",null,0]
[null,null,null,null,null,null,null,null,null,null,null,null,null,null,null,null,null,null,null,null,null,null,null,null,null,null,null,null,null,null,null,null,null,{"$f":"IF(AI264<>\"\",COUNTA($AI$2:$AI264),\"\")","v":""},null,null,null,"",null,"",null,0]
[null,null,null,null,null,null,null,null,null,null,null,null,null,null,null,null,null,null,null,null,null,null,null,null,null,null,null,null,null,null,null,null,null,{"$f":"IF(AI265<>\"\",COUNTA($AI$2:$AI265),\"\")","v":""},null,null,null,"",null,"",null,0]
[null,null,null,null,null,null,null,null,null,null,null,null,null,null,null,null,null,null,null,null,null,null,null,null,null,null,null,null,null,null,null,null,null,{"$f":"IF(AI266<>\"\",COUNTA($AI$2:$AI266),\"\")","v":""},null,null,null,"",null,"",null,0]
[null,null,null,null,null,null,null,null,null,null,null,null,null,null,null,null,null,null,null,null,null,null,null,null,null,null,null,null,null,null,null,null,null,{"$f":"IF(AI267<>\"\",COUNTA($AI$2:$AI267),\"\")","v":""},null,null,null,"",null,"",null,0]
[null,null,null,null,null,null,null,null,null,null,null,null,null,null,null,null,null,null,null,null,null,null,null,null,null,null,null,null,null,null,null,null,null,{"$f":"IF(AI268<>\"\",COUNTA($AI$2:$AI268),\"\")","v":""},null,null,null,"",null,"",null,0]
[null,null,null,null,null,null,null,null,null,null,null,null,null,null,null,null,null,null,null,null,null,null,null,null,null,null,null,null,null,null,null,null,null,{"$f":"IF(AI269<>\"\",COUNTA($AI$2:$AI269),\"\")","v":""},null,null,null,"",null,"",null,0]
[null,null,null,null,null,null,null,null,null,null,null,null,null,null,null,null,null,null,null,null,null,null,null,null,null,null,null,null,null,null,null,null,null,{"$f":"IF(AI270<>\"\",COUNTA($AI$2:$AI270),\"\")","v":""},null,null,null,"",null,"",null,0]
[null,null,null,null,null,null,null,null,null,null,null,null,null,null,null,null,null,null,null,null,null,null,null,null,null,null,null,null,null,null,null,null,null,{"$f":"IF(AI271<>\"\",COUNTA($AI$2:$AI271),\"\")","v":""},null,null,null,"",null,"",null,0]
[null,null,null,null,null,null,null,null,null,null,null,null,null,null,null,null,null,null,null,null,null,null,null,null,null,null,null,null,null,null,null,null,null,{"$f":"IF(AI272<>\"\",COUNTA($AI$2:$AI272),\"\")","v":""},null,null,null,"",null,"",null,0]
[null,null,null,null,null,null,null,null,null,null,null,null,null,null,null,null,null,null,null,null,null,null,null,null,null,null,null,null,null,null,null,null,null,{"$f":"IF(AI273<>\"\",COUNTA($AI$2:$AI273),\"\")","v":""},null,null,null,"",null,"",null,0]
[null,null,null,null,null,null,null,null,null,null,null,null,null,null,null,null,null,null,null,null,null,null,null,null,null,null,null,null,null,null,null,null,null,{"$f":"IF(AI274<>\"\",COUNTA($AI$2:$AI274),\"\")","v":""},null,null,null,"",null,"",null,0]
[null,null,null,null,null,null,null,null,null,null,null,null,null,null,null,null,null,null,null,null,null,null,null,null,null,null,null,null,null,null,null,null,null,{"$f":"IF(AI275<>\"\",COUNTA($AI$2:$AI275),\"\")","v":""},null,null,null,"",null,"",null,0]
[null,null,null,null,null,null,null,null,null,null,null,null,null,null,null,null,null,null,null,null,null,null,null,null,null,null,null,null,null,null,null,null,null,{"$f":"IF(AI276<>\"\",COUNTA($AI$2:$AI276),\"\")","v":""},null,null,null,"",null,"",null,0]
[null,null,null,null,null,null,null,null,null,null,null,null,null,null,null,null,null,null,null,null,null,null,null,null,null,null,null,null,null,null,null,null,null,{"$f":"IF(AI277<>\"\",COUNTA($AI$2:$AI277),\"\")","v":""},null,null,null,"",null,"",null,0]
[null,null,null,null,null,null,null,null,null,null,null,null,null,null,null,null,null,null,null,null,null,null,null,null,null,null,null,null,null,null,null,null,null,{"$f":"IF(AI278<>\"\",COUNTA($AI$2:$AI278),\"\")","v":""},null,null,null,"",null,"",null,0]
[null,null,null,null,null,null,null,null,null,null,null,null,null,null,null,null,null,null,null,null,null,null,null,null,null,null,null,null,null,null,null,null,null,{"$f":"IF(AI279<>\"\",COUNTA($AI$2:$AI279),\"\")","v":""},null,null,null,"",null,"",null,0]
[null,null,null,null,null,null,null,null,null,null,null,null,null,null,null,null,null,null,null,null,null,null,null,null,null,null,null,null,null,null,null,null,null,{"$f":"IF(AI280<>\"\",COUNTA($AI$2:$AI280),\"\")","v":""},null,null,null,"",null,"",null,0]
[null,null,null,null,null,null,null,null,null,null,null,null,null,null,null,null,null,null,null,null,null,null,null,null,null,null,null,null,null,null,null,null,null,{"$f":"IF(AI281<>\"\",COUNTA($AI$2:$AI281),\"\")","v":""},null,null,null,"",null,"",null,0]
[null,null,null,null,null,null,null,null,null,null,null,null,null,null,null,null,null,null,null,null,null,null,null,null,null,null,null,null,null,null,null,null,null,{"$f":"IF(AI282<>\"\",COUNTA($AI$2:$AI282),\"\")","v":""},null,null,null,"",null,"",null,0]
[null,null,null,null,null,null,null,null,null,null,null,null,null,null,null,null,null,null,null,null,null,null,null,null,null,null,null,null,null,null,null,null,null,{"$f":"IF(AI283<>\"\",COUNTA($AI$2:$AI283),\"\")","v":""},null,null,null,"",null,"",null,0]
[null,null,null,null,null,null,null,null,null,null,null,null,null,null,null,null,null,null,null,null,null,null,null,null,null,null,null,null,null,null,null,null,null,{"$f":"IF(AI284<>\"\",COUNTA($AI$2:$AI284),\"\")","v":""},null,null,null,"",null,"",null,0]
[null,null,null,null,null,null,null,null,null,null,null,null,null,null,null,null,null,null,null,null,null,null,null,null,null,null,null,null,null,null,null,null,null,{"$f":"IF(AI285<>\"\",COUNTA($AI$2:$AI285),\"\")","v":""},null,null,null,"",null,"",null,0]
[null,null,null,null,null,null,null,null,null,null,null,null,null,null,null,null,null,null,null,null,null,null,null,null,null,null,null,null,null,null,null,null,null,{"$f":"IF(AI286<>\"\",COUNTA($AI$2:$AI286),\"\")","v":""},null,null,null,"",null,"",null,0]
[null,null,null,null,null,null,null,null,null,null,null,null,null,null,null,null,null,null,null,null,null,null,null,null,null,null,null,null,null,null,null,null,null,{"$f":"IF(AI287<>\"\",COUNTA($AI$2:$AI287),\"\")","v":""},null,null,null,"",null,"",null,0]
[null,null,null,null,null,null,null,null,null,null,null,null,null,null,null,null,null,null,null,null,null,null,null,null,null,null,null,null,null,null,null,null,null,{"$f":"IF(AI288<>\"\",COUNTA($AI$2:$AI288),\"\")","v":""},null,null,null,"",null,"",null,0]
[null,null,null,null,null,null,null,null,null,null,null,null,null,null,null,null,null,null,null,null,null,null,null,null,null,null,null,null,null,null,null,null,null,{"$f":"IF(AI289<>\"\",COUNTA($AI$2:$AI289),\"\")","v":""},null,null,null,"",null,"",null,0]
[null,null,null,null,null,null,null,null,null,null,null,null,null,null,null,null,null,null,null,null,null,null,null,null,null,null,null,null,null,null,null,null,null,{"$f":"IF(AI290<>\"\",COUNTA($AI$2:$AI290),\"\")","v":""},null,null,null,"",null,"",null,0]
[null,null,null,null,null,null,null,null,null,null,null,null,null,null,null,null,null,null,null,null,null,null,null,null,null,null,null,null,null,null,null,null,null,{"$f":"IF(AI291<>\"\",COUNTA($AI$2:$AI291),\"\")","v":""},null,null,null,"",null,"",null,0]
[null,null,null,null,null,null,null,null,null,null,null,null,null,null,null,null,null,null,null,null,null,null,null,null,null,null,null,null,null,null,null,null,null,{"$f":"IF(AI292<>\"\",COUNTA($AI$2:$AI292),\"\")","v":""},null,null,null,"",null,"",null,0]
[null,null,null,null,null,null,null,null,null,null,null,null,null,null,null,null,null,null,null,null,null,null,null,null,null,null,null,null,null,null,null,null,null,{"$f":"IF(AI293<>\"\",COUNTA($AI$2:$AI293),\"\")","v":""},null,null,null,"",null,"",null,0]
[null,null,null,null,null,null,null,null,null,null,null,null,null,null,null,null,null,null,null,null,null,null,null,null,null,null,null,null,null,null,null,null,null,{"$f":"IF(AI294<>\"\",COUNTA($AI$2:$AI294),\"\")","v":""},null,null,null,"",null,"",null,0]
[null,null,null,null,null,null,null,null,null,null,null,null,null,null,null,null,null,null,null,null,null,null,null,null,null,null,null,null,null,null,null,null,null,{"$f":"IF(AI295<>\"\",COUNTA($AI$2:$AI295),\"\")","v":""},null,null,null,"",null,"",null,0]
[null,null,null,null,null,null,null,null,null,null,null,null,null,null,null,null,null,null,null,null,null,null,null,null,null,null,null,null,null,null,null,null,null,{"$f":"IF(AI296<>\"\",COUNTA($AI$2:$AI296),\"\")","v":""},null,null,null,"",null,"",null,0]
[null,null,null,null,null,null,null,null,null,null,null,null,null,null,null,null,null,null,null,null,null,null,null,null,null,null,null,null,null,null,null,null,null,{"$f":"IF(AI297<>\"\",COUNTA($AI$2:$AI297),\"\")","v":""},null,null,null,"",null,"",null,0]
[null,null,null,null,null,null,null,null,null,null,null,null,null,null,null,null,null,null,null,null,null,null,null,null,null,null,null,null,null,null,null,null,null,{"$f":"IF(AI298<>\"\",COUNTA($AI$2:$AI298),\"\")","v":""},null,null,null,"",null,"",null,0]
[null,null,null,null,null,null,null,null,null,null,null,null,null,null,null,null,null,null,null,null,null,null,null,null,null,null,null,null,null,null,null,null,null,{"$f":"IF(AI299<>\"\",COUNTA($AI$2:$AI299),\"\")","v":""},null,null,null,"",null,"",null,0]
[null,null,null,null,null,null,null,null,null,null,null,null,null,null,null,null,null,null,null,null,null,null,null,null,null,null,null,null,null,null,null,null,null,{"$f":"IF(AI300<>\"\",COUNTA($AI$2:$AI300),\"\")","v":""},null,null,null,"",null,"",null,0]
[null,null,null,null,null,null,null,null,null,null,null,null,null,null,null,null,null,null,null,null,null,null,null,null,null,null,null,null,null,null,null,null,null,{"$f":"IF(AI301<>\"\",COUNTA($AI$2:$AI301),\"\")","v":""},null,null,null,"",null,"",null,0]
[null,null,null,null,null,null,null,null,null,null,null,null,null,null,null,null,null,null,null,null,null,null,null,null,null,null,null,null,null,null,null,null,null,{"$f":"IF(AI302<>\"\",COUNTA($AI$2:$AI302),\"\")","v":""},null,null,null,"",null,"",null,0]
[null,null,null,null,null,null,null,null,null,null,null,null,null,null,null,null,null,null,null,null,null,null,null,null,null,null,null,null,null,null,null,null,null,{"$f":"IF(AI303<>\"\",COUNTA($AI$2:$AI303),\"\")","v":""},null,null,null,"",null,"",null,0]
[null,null,null,null,null,null,null,null,null,null,null,null,null,null,null,null,null,null,null,null,null,null,null,null,null,null,null,null,null,null,null,null,null,{"$f":"IF(AI304<>\"\",COUNTA($AI$2:$AI304),\"\")","v":""},null,null,null,"",null,"",null,0]
[null,null,null,null,null,null,null,null,null,null,null,null,null,null,null,null,null,null,null,null,null,null,null,null,null,null,null,null,null,null,null,null,null,{"$f":"IF(AI305<>\"\",COUNTA($AI$2:$AI305),\"\")","v":""},null,null,null,"",null,"",null,0]
[null,null,null,null,null,null,null,null,null,null,null,null,null,null,null,null,null,null,null,null,null,null,null,null,null,null,null,null,null,null,null,null,null,{"$f":"IF(AI306<>\"\",COUNTA($AI$2:$AI306),\"\")","v":""},null,null,null,"",null,"",null,0]
[null,null,null,null,null,null,null,null,null,null,null,null,null,null,null,null,null,null,null,null,null,null,null,null,null,null,null,null,null,null,null,null,null,{"$f":"IF(AI307<>\"\",COUNTA($AI$2:$AI307),\"\")","v":""},null,null,null,"",null,"",null,0]
[null,null,null,null,null,null,null,null,null,null,null,null,null,null,null,null,null,null,null,null,null,null,null,null,null,null,null,null,null,null,null,null,null,{"$f":"IF(AI308<>\"\",COUNTA($AI$2:$AI308),\"\")","v":""},null,null,null,"",null,"",null,0]
[null,null,null,null,null,null,null,null,null,null,null,null,null,null,null,null,null,null,null,null,null,null,null,null,null,null,null,null,null,null,null,null,null,{"$f":"IF(AI309<>\"\",COUNTA($AI$2:$AI309),\"\")","v":""},null,null,null,"",null,"",null,0]
[null,null,null,null,null,null,null,null,null,null,null,null,null,null,null,null,null,null,null,null,null,null,null,null,null,null,null,null,null,null,null,null,null,{"$f":"IF(AI310<>\"\",COUNTA($AI$2:$AI310),\"\")","v":""},null,null,null,"",null,"",null,0]
[null,null,null,null,null,null,null,null,null,null,null,null,null,null,null,null,null,null,null,null,null,null,null,null,null,null,null,null,null,null,null,null,null,{"$f":"IF(AI311<>\"\",COUNTA($AI$2:$AI311),\"\")","v":""},null,null,null,"",null,"",null,0]
[null,null,null,null,null,null,null,null,null,null,null,null,null,null,null,null,null,null,null,null,null,null,null,null,null,null,null,null,null,null,null,null,null,{"$f":"IF(AI312<>\"\",COUNTA($AI$2:$AI312),\"\")","v":""},null,null,null,"",null,"",null,0]
[null,null,null,null,null,null,null,null,null,null,null,null,null,null,null,null,null,null,null,null,null,null,null,null,null,null,null,null,null,null,null,null,null,{"$f":"IF(AI313<>\"\",COUNTA($AI$2:$AI313),\"\")","v":""},null,null,null,"",null,"",null,0]
[null,null,null,null,null,null,null,null,null,null,null,null,null,null,null,null,null,null,null,null,null,null,null,null,null,null,null,null,null,null,null,null,null,{"$f":"IF(AI314<>\"\",COUNTA($AI$2:$AI314),\"\")","v":""},null,null,null,"",null,"",null,0]
[null,null,null,null,null,null,null,null,null,null,null,null,null,null,null,null,null,null,null,null,null,null,null,null,null,null,null,null,null,null,null,null,null,{"$f":"IF(AI315<>\"\",COUNTA($AI$2:$AI315),\"\")","v":""},null,null,null,"",null,"",null,0]
[null,null,null,null,null,null,null,null,null,null,null,null,null,null,null,null,null,null,null,null,null,null,null,null,null,null,null,null,null,null,null,null,null,{"$f":"IF(AI316<>\"\",COUNTA($AI$2:$AI316),\"\")","v":""},null,null,null,"",null,"",null,0]
[null,null,null,null,null,null,null,null,null,null,null,null,null,null,null,null,null,null,null,null,null,null,null,null,null,null,null,null,null,null,null,null,null,{"$f":"IF(AI317<>\"\",COUNTA($AI$2:$AI317),\"\")","v":""},null,null,null,"",null,"",null,0]
[null,null,null,null,null,null,null,null,null,null,null,null,null,null,null,null,null,null,null,null,null,null,null,null,null,null,null,null,null,null,null,null,null,{"$f":"IF(AI318<>\"\",COUNTA($AI$2:$AI318),\"\")","v":""},null,null,null,"",null,"",null,0]
[null,null,null,null,null,null,null,null,null,null,null,null,null,null,null,null,null,null,null,null,null,null,null,null,null,null,null,null,null,null,null,null,null,{"$f":"IF(AI319<>\"\",COUNTA($AI$2:$AI319),\"\")","v":""},null,null,null,"",null,"",null,0]
[null,null,null,null,null,null,null,null,null,null,null,null,null,null,null,null,null,null,null,null,null,null,null,null,null,null,null,null,null,null,null,null,null,{"$f":"IF(AI320<>\"\",COUNTA($AI$2:$AI320),\"\")","v":""},null,null,null,"",null,"",null,0]
[null,null,null,null,null,null,null,null,null,null,null,null,null,null,null,null,null,null,null,null,null,null,null,null,null,null,null,null,null,null,null,null,null,{"$f":"IF(AI321<>\"\",COUNTA($AI$2:$AI321),\"\")","v":""},null,null,null,"",null,"",null,0]
[null,null,null,null,null,null,null,null,null,null,null,null,null,null,null,null,null,null,null,null,null,null,null,null,null,null,null,null,null,null,null,null,null,{"$f":"IF(AI322<>\"\",COUNTA($AI$2:$AI322),\"\")","v":""},null,null,null,{"$f":"IFERROR(IF(AI322=\"\",\"\",IF(AJ322=\"gesetzt\",RAND()*5000000,RAND()*1000*20)),\"\")","v":""},null,"",null,0]
[null,null,null,null,null,null,null,null,null,null,null,null,null,null,null,null,null,null,null,null,null,null,null,null,null,null,null,null,null,null,null,null,null,{"$f":"IF(AI323<>\"\",COUNTA($AI$2:$AI323),\"\")","v":""},null,null,null,"",null,{"$f":"IF(AJ323=\"\",\"\",AJ323)","v":""},null,{"$f":"IF(AN323=\"gesetzt\",1,0)","v":0}]
[null,null,null,null,null,null,null,null,null,null,null,null,null,null,null,null,null,null,null,null,null,null,null,null,null,null,null,null,null,null,null,null,null,{"$f":"IF(AI324<>\"\",COUNTA($AI$2:$AI324),\"\")","v":""},null,null,null,"",null,"",null,0]
[null,null,null,null,null,null,null,null,null,null,null,null,null,null,null,null,null,null,null,null,null,null,null,null,null,null,null,null,null,null,null,null,null,{"$f":"IF(AI325<>\"\",COUNTA($AI$2:$AI325),\"\")","v":""},null,null,null,"",null,"",null,0]
[null,null,null,null,null,null,null,null,null,null,null,null,null,null,null,null,null,null,null,null,null,null,null,null,null,null,null,null,null,null,null,null,null,{"$f":"IF(AI326<>\"\",COUNTA($AI$2:$AI326),\"\")","v":""},null,null,null,"",null,"",null,0]
[null,null,null,null,null,null,null,null,null,null,null,null,null,null,null,null,null,null,null,null,null,null,null,null,null,null,null,null,null,null,null,null,null,{"$f":"IF(AI327<>\"\",COUNTA($AI$2:$AI327),\"\")","v":""},null,null,null,"",null,"",null,0]
[null,null,null,null,null,null,null,null,null,null,null,null,null,null,null,null,null,null,null,null,null,null,null,null,null,null,null,null,null,null,null,null,null,{"$f":"IF(AI328<>\"\",COUNTA($AI$2:$AI328),\"\")","v":""},null,null,null,"",null,"",null,0]
[null,null,null,null,null,null,null,null,null,null,null,null,null,null,null,null,null,null,null,null,null,null,null,null,null,null,null,null,null,null,null,null,null,{"$f":"IF(AI329<>\"\",COUNTA($AI$2:$AI329),\"\")","v":""},null,null,null,"",null,"",null,0]
[null,null,null,null,null,null,null,null,null,null,null,null,null,null,null,null,null,null,null,null,null,null,null,null,null,null,null,null,null,null,null,null,null,{"$f":"IF(AI330<>\"\",COUNTA($AI$2:$AI330),\"\")","v":""},null,null,null,"",null,"",null,0]
[null,null,null,null,null,null,null,null,null,null,null,null,null,null,null,null,null,null,null,null,null,null,null,null,null,null,null,null,null,null,null,null,null,{"$f":"IF(AI331<>\"\",COUNTA($AI$2:$AI331),\"\")","v":""},null,null,null,"",null,"",null,0]
[null,null,null,null,null,null,null,null,null,null,null,null,null,null,null,null,null,null,null,null,null,null,null,null,null,null,null,null,null,null,null,null,null,{"$f":"IF(AI332<>\"\",COUNTA($AI$2:$AI332),\"\")","v":""},null,null,null,"",null,"",null,0]
[null,null,null,null,null,null,null,null,null,null,null,null,null,null,null,null,null,null,null,null,null,null,null,null,null,null,null,null,null,null,null,null,null,{"$f":"IF(AI333<>\"\",COUNTA($AI$2:$AI333),\"\")","v":""},null,null,null,"",null,"",null,0]
[null,null,null,null,null,null,null,null,null,null,null,null,null,null,null,null,null,null,null,null,null,null,null,null,null,null,null,null,null,null,null,null,null,{"$f":"IF(AI334<>\"\",COUNTA($AI$2:$AI334),\"\")","v":""},null,null,null,"",null,"",null,0]
[null,null,null,null,null,null,null,null,null,null,null,null,null,null,null,null,null,null,null,null,null,null,null,null,null,null,null,null,null,null,null,null,null,{"$f":"IF(AI335<>\"\",COUNTA($AI$2:$AI335),\"\")","v":""},null,null,null,"",null,"",null,0]
[null,null,null,null,null,null,null,null,null,null,null,null,null,null,null,null,null,null,null,null,null,null,null,null,null,null,null,null,null,null,null,null,null,{"$f":"IF(AI336<>\"\",COUNTA($AI$2:$AI336),\"\")","v":""},null,null,null,"",null,"",null,0]
[null,null,null,null,null,null,null,null,null,null,null,null,null,null,null,null,null,null,null,null,null,null,null,null,null,null,null,null,null,null,null,null,null,{"$f":"IF(AI337<>\"\",COUNTA($AI$2:$AI337),\"\")","v":""},null,null,null,"",null,"",null,0]
[null,null,null,null,null,null,null,null,null,null,null,null,null,null,null,null,null,null,null,null,null,null,null,null,null,null,null,null,null,null,null,null,null,{"$f":"IF(AI338<>\"\",COUNTA($AI$2:$AI338),\"\")","v":""},null,null,null,"",null,"",null,0]
[null,null,null,null,null,null,null,null,null,null,null,null,null,null,null,null,null,null,null,null,null,null,null,null,null,null,null,null,null,null,null,null,null,{"$f":"IF(AI339<>\"\",COUNTA($AI$2:$AI339),\"\")","v":""},null,null,null,"",null,"",null,0]
[null,null,null,null,null,null,null,null,null,null,null,null,null,null,null,null,null,null,null,null,null,null,null,null,null,null,null,null,null,null,null,null,null,{"$f":"IF(AI340<>\"\",COUNTA($AI$2:$AI340),\"\")","v":""},null,null,null,"",null,"",null,0]
[null,null,null,null,null,null,null,null,null,null,null,null,null,null,null,null,null,null,null,null,null,null,null,null,null,null,null,null,null,null,null,null,null,{"$f":"IF(AI341<>\"\",COUNTA($AI$2:$AI341),\"\")","v":""},null,null,null,"",null,"",null,0]
[null,null,null,null,null,null,null,null,null,null,null,null,null,null,null,null,null,null,null,null,null,null,null,null,null,null,null,null,null,null,null,null,null,{"$f":"IF(AI342<>\"\",COUNTA($AI$2:$AI342),\"\")","v":""},null,null,null,"",null,"",null,0]
[null,null,null,null,null,null,null,null,null,null,null,null,null,null,null,null,null,null,null,null,null,null,null,null,null,null,null,null,null,null,null,null,null,{"$f":"IF(AI343<>\"\",COUNTA($AI$2:$AI343),\"\")","v":""},null,null,null,"",null,"",null,0]
[null,null,null,null,null,null,null,null,null,null,null,null,null,null,null,null,null,null,null,null,null,null,null,null,null,null,null,null,null,null,null,null,null,{"$f":"IF(AI344<>\"\",COUNTA($AI$2:$AI344),\"\")","v":""},null,null,null,"",null,"",null,0]
[null,null,null,null,null,null,null,null,null,null,null,null,null,null,null,null,null,null,null,null,null,null,null,null,null,null,null,null,null,null,null,null,null,{"$f":"IF(AI345<>\"\",COUNTA($AI$2:$AI345),\"\")","v":""},null,null,null,"",null,"",null,0]
[null,null,null,null,null,null,null,null,null,null,null,null,null,null,null,null,null,null,null,null,null,null,null,null,null,null,null,null,null,null,null,null,null,{"$f":"IF(AI346<>\"\",COUNTA($AI$2:$AI346),\"\")","v":""},null,null,null,"",null,"",null,0]
[null,null,null,null,null,null,null,null,null,null,null,null,null,null,null,null,null,null,null,null,null,null,null,null,null,null,null,null,null,null,null,null,null,{"$f":"IF(AI347<>\"\",COUNTA($AI$2:$AI347),\"\")","v":""},null,null,null,"",null,"",null,0]
[null,null,null,null,null,null,null,null,null,null,null,null,null,null,null,null,null,null,null,null,null,null,null,null,null,null,null,null,null,null,null,null,null,{"$f":"IF(AI348<>\"\",COUNTA($AI$2:$AI348),\"\")","v":""},null,null,null,"",null,"",null,0]
[null,null,null,null,null,null,null,null,null,null,null,null,null,null,null,null,null,null,null,null,null,null,null,null,null,null,null,null,null,null,null,null,null,{"$f":"IF(AI349<>\"\",COUNTA($AI$2:$AI349),\"\")","v":""},null,null,null,"",null,"",null,0]
[null,null,null,null,null,null,null,null,null,null,null,null,null,null,null,null,null,null,null,null,null,null,null,null,null,null,null,null,null,null,null,null,null,{"$f":"IF(AI350<>\"\",COUNTA($AI$2:$AI350),\"\")","v":""},null,null,null,"",null,"",null,0]
[null,null,null,null,null,null,null,null,null,null,null,null,null,null,null,null,null,null,null,null,null,null,null,null,null,null,null,null,null,null,null,null,null,{"$f":"IF(AI351<>\"\",COUNTA($AI$2:$AI351),\"\")","v":""},null,null,null,"",null,"",null,0]
[null,null,null,null,null,null,null,null,null,null,null,null,null,null,null,null,null,null,null,null,null,null,null,null,null,null,null,null,null,null,null,null,null,{"$f":"IF(AI352<>\"\",COUNTA($AI$2:$AI352),\"\")","v":""},null,null,null,"",null,"",null,0]
[null,null,null,null,null,null,null,null,null,null,null,null,null,null,null,null,null,null,null,null,null,null,null,null,null,null,null,null,null,null,null,null,null,{"$f":"IF(AI353<>\"\",COUNTA($AI$2:$AI353),\"\")","v":""},null,null,null,"",null,"",null,0]
[null,null,null,null,null,null,null,null,null,null,null,null,null,null,null,null,null,null,null,null,null,null,null,null,null,null,null,null,null,null,null,null,null,{"$f":"IF(AI354<>\"\",COUNTA($AI$2:$AI354),\"\")","v":""},null,null,null,"",null,"",null,0]
[null,null,null,null,null,null,null,null,null,null,null,null,null,null,null,null,null,null,null,null,null,null,null,null,null,null,null,null,null,null,null,null,null,{"$f":"IF(AI355<>\"\",COUNTA($AI$2:$AI355),\"\")","v":""},null,null,null,"",null,"",null,0]
[null,null,null,null,null,null,null,null,null,null,null,null,null,null,null,null,null,null,null,null,null,null,null,null,null,null,null,null,null,null,null,null,null,{"$f":"IF(AI356<>\"\",COUNTA($AI$2:$AI356),\"\")","v":""},null,null,null,"",null,"",null,0]
[null,null,null,null,null,null,null,null,null,null,null,null,null,null,null,null,null,null,null,null,null,null,null,null,null,null,null,null,null,null,null,null,null,{"$f":"IF(AI357<>\"\",COUNTA($AI$2:$AI357),\"\")","v":""},null,null,null,"",null,"",null,0]
[null,null,null,null,null,null,null,null,null,null,null,null,null,null,null,null,null,null,null,null,null,null,null,null,null,null,null,null,null,null,null,null,null,{"$f":"IF(AI358<>\"\",COUNTA($AI$2:$AI358),\"\")","v":""},null,null,null,"",null,"",null,0]
[null,null,null,null,null,null,null,null,null,null,null,null,null,null,null,null,null,null,null,null,null,null,null,null,null,null,null,null,null,null,null,null,null,{"$f":"IF(AI359<>\"\",COUNTA($AI$2:$AI359),\"\")","v":""},null,null,null,"",null,"",null,0]
[null,null,null,null,null,null,null,null,null,null,null,null,null,null,null,null,null,null,null,null,null,null,null,null,null,null,null,null,null,null,null,null,null,{"$f":"IF(AI360<>\"\",COUNTA($AI$2:$AI360),\"\")","v":""},null,null,null,"",null,"",null,0]
[null,null,null,null,null,null,null,null,null,null,null,null,null,null,null,null,null,null,null,null,null,null,null,null,null,null,null,null,null,null,null,null,null,{"$f":"IF(AI361<>\"\",COUNTA($AI$2:$AI361),\"\")","v":""},null,null,null,"",null,"",null,0]
[null,null,null,null,null,null,null,null,null,null,null,null,null,null,null,null,null,null,null,null,null,null,null,null,null,null,null,null,null,null,null,null,null,{"$f":"IF(AI362<>\"\",COUNTA($AI$2:$AI362),\"\")","v":""},null,null,null,"",null,"",null,0]
[null,null,null,null,null,null,null,null,null,null,null,null,null,null,null,null,null,null,null,null,null,null,null,null,null,null,null,null,null,null,null,null,null,{"$f":"IF(AI363<>\"\",COUNTA($AI$2:$AI363),\"\")","v":""},null,null,null,"",null,"",null,0]
[null,null,null,null,null,null,null,null,null,null,null,null,null,null,null,null,null,null,null,null,null,null,null,null,null,null,null,null,null,null,null,null,null,{"$f":"IF(AI364<>\"\",COUNTA($AI$2:$AI364),\"\")","v":""},null,null,null,"",null,"",null,0]
[null,null,null,null,null,null,null,null,null,null,null,null,null,null,null,null,null,null,null,null,null,null,null,null,null,null,null,null,null,null,null,null,null,{"$f":"IF(AI365<>\"\",COUNTA($AI$2:$AI365),\"\")","v":""},null,null,null,"",null,"",null,0]
[null,null,null,null,null,null,null,null,null,null,null,null,null,null,null,null,null,null,null,null,null,null,null,null,null,null,null,null,null,null,null,null,null,{"$f":"IF(AI366<>\"\",COUNTA($AI$2:$AI366),\"\")","v":""},null,null,null,"",null,"",null,0]
[null,null,null,null,null,null,null,null,null,null,null,null,null,null,null,null,null,null,null,null,null,null,null,null,null,null,null,null,null,null,null,null,null,{"$f":"IF(AI367<>\"\",COUNTA($AI$2:$AI367),\"\")","v":""},null,null,null,"",null,"",null,0]
[null,null,null,null,null,null,null,null,null,null,null,null,null,null,null,null,null,null,null,null,null,null,null,null,null,null,null,null,null,null,null,null,null,{"$f":"IF(AI368<>\"\",COUNTA($AI$2:$AI368),\"\")","v":""},null,null,null,"",null,"",null,0]
[null,null,null,null,null,null,null,null,null,null,null,null,null,null,null,null,null,null,null,null,null,null,null,null,null,null,null,null,null,null,null,null,null,{"$f":"IF(AI369<>\"\",COUNTA($AI$2:$AI369),\"\")","v":""},null,null,null,"",null,"",null,0]
[null,null,null,null,null,null,null,null,null,null,null,null,null,null,null,null,null,null,null,null,null,null,null,null,null,null,null,null,null,null,null,null,null,{"$f":"IF(AI370<>\"\",COUNTA($AI$2:$AI370),\"\")","v":""},null,null,null,"",null,"",null,0]
[null,null,null,null,null,null,null,null,null,null,null,null,null,null,null,null,null,null,null,null,null,null,null,null,null,null,null,null,null,null,null,null,null,{"$f":"IF(AI371<>\"\",COUNTA($AI$2:$AI371),\"\")","v":""},null,null,null,"",null,"",null,0]
[null,null,null,null,null,null,null,null,null,null,null,null,null,null,null,null,null,null,null,null,null,null,null,null,null,null,null,null,null,null,null,null,null,{"$f":"IF(AI372<>\"\",COUNTA($AI$2:$AI372),\"\")","v":""},null,null,null,"",null,"",null,0]
[null,null,null,null,null,null,null,null,null,null,null,null,null,null,null,null,null,null,null,null,null,null,null,null,null,null,null,null,null,null,null,null,null,{"$f":"IF(AI373<>\"\",COUNTA($AI$2:$AI373),\"\")","v":""},null,null,null,"",null,"",null,0]
[null,null,null,null,null,null,null,null,null,null,null,null,null,null,null,null,null,null,null,null,null,null,null,null,null,null,null,null,null,null,null,null,null,{"$f":"IF(AI374<>\"\",COUNTA($AI$2:$AI374),\"\")","v":""},null,null,null,"",null,"",null,0]
[null,null,null,null,null,null,null,null,null,null,null,null,null,null,null,null,null,null,null,null,null,null,null,null,null,null,null,null,null,null,null,null,null,{"$f":"IF(AI375<>\"\",COUNTA($AI$2:$AI375),\"\")","v":""},null,null,null,"",null,"",null,0]
[null,null,null,null,null,null,null,null,null,null,null,null,null,null,null,null,null,null,null,null,null,null,null,null,null,null,null,null,null,null,null,null,null,{"$f":"IF(AI376<>\"\",COUNTA($AI$2:$AI376),\"\")","v":""},null,null,null,"",null,"",null,0]
[null,null,null,null,null,null,null,null,null,null,null,null,null,null,null,null,null,null,null,null,null,null,null,null,null,null,null,null,null,null,null,null,null,{"$f":"IF(AI377<>\"\",COUNTA($AI$2:$AI377),\"\")","v":""},null,null,null,"",null,"",null,0]
[null,null,null,null,null,null,null,null,null,null,null,null,null,null,null,null,null,null,null,null,null,null,null,null,null,null,null,null,null,null,null,null,null,{"$f":"IF(AI378<>\"\",COUNTA($AI$2:$AI378),\"\")","v":""},null,null,null,"",null,"",null,0]
[null,null,null,null,null,null,null,null,null,null,null,null,null,null,null,null,null,null,null,null,null,null,null,null,null,null,null,null,null,null,null,null,null,{"$f":"IF(AI379<>\"\",COUNTA($AI$2:$AI379),\"\")","v":""},null,null,null,"",null,"",null,0]
[null,null,null,null,null,null,null,null,null,null,null,null,null,null,null,null,null,null,null,null,null,null,null,null,null,null,null,null,null,null,null,null,null,{"$f":"IF(AI380<>\"\",COUNTA($AI$2:$AI380),\"\")","v":""},null,null,null,"",null,"",null,0]
[null,null,null,null,null,null,null,null,null,null,null,null,null,null,null,null,null,null,null,null,null,null,null,null,null,null,null,null,null,null,null,null,null,{"$f":"IF(AI381<>\"\",COUNTA($AI$2:$AI381),\"\")","v":""},null,null,null,"",null,"",null,0]
[null,null,null,null,null,null,null,null,null,null,null,null,null,null,null,null,null,null,null,null,null,null,null,null,null,null,null,null,null,null,null,null,null,{"$f":"IF(AI382<>\"\",COUNTA($AI$2:$AI382),\"\")","v":""},null,null,null,"",null,"",null,0]
[null,null,null,null,null,null,null,null,null,null,null,null,null,null,null,null,null,null,null,null,null,null,null,null,null,null,null,null,null,null,null,null,null,{"$f":"IF(AI383<>\"\",COUNTA($AI$2:$AI383),\"\")","v":""},null,null,null,"",null,"",null,0]
[null,null,null,null,null,null,null,null,null,null,null,null,null,null,null,null,null,null,null,null,null,null,null,null,null,null,null,null,null,null,null,null,null,{"$f":"IF(AI384<>\"\",COUNTA($AI$2:$AI384),\"\")","v":""},null,null,null,"",null,"",null,0]
[null,null,null,null,null,null,null,null,null,null,null,null,null,null,null,null,null,null,null,null,null,null,null,null,null,null,null,null,null,null,null,null,null,{"$f":"IF(AI385<>\"\",COUNTA($AI$2:$AI385),\"\")","v":""},null,null,null,"",null,"",null,0]
[null,null,null,null,null,null,null,null,null,null,null,null,null,null,null,null,null,null,null,null,null,null,null,null,null,null,null,null,null,null,null,null,null,{"$f":"IF(AI386<>\"\",COUNTA($AI$2:$AI386),\"\")","v":""},null,null,null,{"$f":"IFERROR(IF(AI386=\"\",\"\",IF(AJ386=\"gesetzt\",RAND()*5000000,RAND()*1000*20)),\"\")","v":""},null,"",null,0]
[null,null,null,null,null,null,null,null,null,null,null,null,null,null,null,null,null,null,null,null,null,null,null,null,null,null,null,null,null,null,null,null,null,{"$f":"IF(AI387<>\"\",COUNTA($AI$2:$AI387),\"\")","v":""},null,null,null,"",null,{"$f":"IF(AJ387=\"\",\"\",AJ387)","v":""},null,{"$f":"IF(AN387=\"gesetzt\",1,0)","v":0}]
[null,null,null,null,null,null,null,null,null,null,null,null,null,null,null,null,null,null,null,null,null,null,null,null,null,null,null,null,null,null,null,null,null,{"$f":"IF(AI388<>\"\",COUNTA($AI$2:$AI388),\"\")","v":""},null,null,null,"",null,"",null,0]
[null,null,null,null,null,null,null,null,null,null,null,null,null,null,null,null,null,null,null,null,null,null,null,null,null,null,null,null,null,null,null,null,null,{"$f":"IF(AI389<>\"\",COUNTA($AI$2:$AI389),\"\")","v":""},null,null,null,"",null,"",null,0]
[null,null,null,null,null,null,null,null,null,null,null,null,null,null,null,null,null,null,null,null,null,null,null,null,null,null,null,null,null,null,null,null,null,{"$f":"IF(AI390<>\"\",COUNTA($AI$2:$AI390),\"\")","v":""},null,null,null,"",null,"",null,0]
[null,null,null,null,null,null,null,null,null,null,null,null,null,null,null,null,null,null,null,null,null,null,null,null,null,null,null,null,null,null,null,null,null,{"$f":"IF(AI391<>\"\",COUNTA($AI$2:$AI391),\"\")","v":""},null,null,null,"",null,"",null,0]
[null,null,null,null,null,null,null,null,null,null,null,null,null,null,null,null,null,null,null,null,null,null,null,null,null,null,null,null,null,null,null,null,null,{"$f":"IF(AI392<>\"\",COUNTA($AI$2:$AI392),\"\")","v":""},null,null,null,"",null,"",null,0]
[null,null,null,null,null,null,null,null,null,null,null,null,null,null,null,null,null,null,null,null,null,null,null,null,null,null,null,null,null,null,null,null,null,{"$f":"IF(AI393<>\"\",COUNTA($AI$2:$AI393),\"\")","v":""},null,null,null,"",null,"",null,0]
[null,null,null,null,null,null,null,null,null,null,null,null,null,null,null,null,null,null,null,null,null,null,null,null,null,null,null,null,null,null,null,null,null,{"$f":"IF(AI394<>\"\",COUNTA($AI$2:$AI394),\"\")","v":""},null,null,null,"",null,"",null,0]
[null,null,null,null,null,null,null,null,null,null,null,null,null,null,null,null,null,null,null,null,null,null,null,null,null,null,null,null,null,null,null,null,null,{"$f":"IF(AI395<>\"\",COUNTA($AI$2:$AI395),\"\")","v":""},null,null,null,"",null,"",null,0]
[null,null,null,null,null,null,null,null,null,null,null,null,null,null,null,null,null,null,null,null,null,null,null,null,null,null,null,null,null,null,null,null,null,{"$f":"IF(AI396<>\"\",COUNTA($AI$2:$AI396),\"\")","v":""},null,null,null,"",null,"",null,0]
[null,null,null,null,null,null,null,null,null,null,null,null,null,null,null,null,null,null,null,null,null,null,null,null,null,null,null,null,null,null,null,null,null,{"$f":"IF(AI397<>\"\",COUNTA($AI$2:$AI397),\"\")","v":""},null,null,null,"",null,"",null,0]
[null,null,null,null,null,null,null,null,null,null,null,null,null,null,null,null,null,null,null,null,null,null,null,null,null,null,null,null,null,null,null,null,null,{"$f":"IF(AI398<>\"\",COUNTA($AI$2:$AI398),\"\")","v":""},null,null,null,"",null,"",null,0]
[null,null,null,null,null,null,null,null,null,null,null,null,null,null,null,null,null,null,null,null,null,null,null,null,null,null,null,null,null,null,null,null,null,{"$f":"IF(AI399<>\"\",COUNTA($AI$2:$AI399),\"\")","v":""},null,null,null,"",null,"",null,0]
[null,null,null,null,null,null,null,null,null,null,null,null,null,null,null,null,null,null,null,null,null,null,null,null,null,null,null,null,null,null,null,null,null,{"$f":"IF(AI400<>\"\",COUNTA($AI$2:$AI400),\"\")","v":""},null,null,null,"",null,"",null,0]
[null,null,null,null,null,null,null,null,null,null,null,null,null,null,null,null,null,null,null,null,null,null,null,null,null,null,null,null,null,null,null,null,null,{"$f":"IF(AI401<>\"\",COUNTA($AI$2:$AI401),\"\")","v":""},null,null,null,"",null,"",null,0]
[null,null,null,null,null,null,null,null,null,null,null,null,null,null,null,null,null,null,null,null,null,null,null,null,null,null,null,null,null,null,null,null,null,{"$f":"IF(AI402<>\"\",COUNTA($AI$2:$AI402),\"\")","v":""},null,null,null,"",null,"",null,0]
[null,null,null,null,null,null,null,null,null,null,null,null,null,null,null,null,null,null,null,null,null,null,null,null,null,null,null,null,null,null,null,null,null,{"$f":"IF(AI403<>\"\",COUNTA($AI$2:$AI403),\"\")","v":""},null,null,null,"",null,"",null,0]
[null,null,null,null,null,null,null,null,null,null,null,null,null,null,null,null,null,null,null,null,null,null,null,null,null,null,null,null,null,null,null,null,null,{"$f":"IF(AI404<>\"\",COUNTA($AI$2:$AI404),\"\")","v":""},null,null,null,"",null,"",null,0]
[null,null,null,null,null,null,null,null,null,null,null,null,null,null,null,null,null,null,null,null,null,null,null,null,null,null,null,null,null,null,null,null,null,{"$f":"IF(AI405<>\"\",COUNTA($AI$2:$AI405),\"\")","v":""},null,null,null,"",null,"",null,0]
[null,null,null,null,null,null,null,null,null,null,null,null,null,null,null,null,null,null,null,null,null,null,null,null,null,null,null,null,null,null,null,null,null,{"$f":"IF(AI406<>\"\",COUNTA($AI$2:$AI406),\"\")","v":""},null,null,null,"",null,"",null,0]
[null,null,null,null,null,null,null,null,null,null,null,null,null,null,null,null,null,null,null,null,null,null,null,null,null,null,null,null,null,null,null,null,null,{"$f":"IF(AI407<>\"\",COUNTA($AI$2:$AI407),\"\")","v":""},null,null,null,"",null,"",null,0]
[null,null,null,null,null,null,null,null,null,null,null,null,null,null,null,null,null,null,null,null,null,null,null,null,null,null,null,null,null,null,null,null,null,{"$f":"IF(AI408<>\"\",COUNTA($AI$2:$AI408),\"\")","v":""},null,null,null,"",null,"",null,0]
[null,null,null,null,null,null,null,null,null,null,null,null,null,null,null,null,null,null,null,null,null,null,null,null,null,null,null,null,null,null,null,null,null,{"$f":"IF(AI409<>\"\",COUNTA($AI$2:$AI409),\"\")","v":""},null,null,null,"",null,"",null,0]
[null,null,null,null,null,null,null,null,null,null,null,null,null,null,null,null,null,null,null,null,null,null,null,null,null,null,null,null,null,null,null,null,null,{"$f":"IF(AI410<>\"\",COUNTA($AI$2:$AI410),\"\")","v":""},null,null,null,"",null,"",null,0]
[null,null,null,null,null,null,null,null,null,null,null,null,null,null,null,null,null,null,null,null,null,null,null,null,null,null,null,null,null,null,null,null,null,{"$f":"IF(AI411<>\"\",COUNTA($AI$2:$AI411),\"\")","v":""},null,null,null,"",null,"",null,0]
[null,null,null,null,null,null,null,null,null,null,null,null,null,null,null,null,null,null,null,null,null,null,null,null,null,null,null,null,null,null,null,null,null,{"$f":"IF(AI412<>\"\",COUNTA($AI$2:$AI412),\"\")","v":""},null,null,null,"",null,"",null,0]
[null,null,null,null,null,null,null,null,null,null,null,null,null,null,null,null,null,null,null,null,null,null,null,null,null,null,null,null,null,null,null,null,null,{"$f":"IF(AI413<>\"\",COUNTA($AI$2:$AI413),\"\")","v":""},null,null,null,"",null,"",null,0]
[null,null,null,null,null,null,null,null,null,null,null,null,null,null,null,null,null,null,null,null,null,null,null,null,null,null,null,null,null,null,null,null,null,{"$f":"IF(AI414<>\"\",COUNTA($AI$2:$AI414),\"\")","v":""},null,null,null,"",null,"",null,0]
[null,null,null,null,null,null,null,null,null,null,null,null,null,null,null,null,null,null,null,null,null,null,null,null,null,null,null,null,null,null,null,null,null,{"$f":"IF(AI415<>\"\",COUNTA($AI$2:$AI415),\"\")","v":""},null,null,null,"",null,"",null,0]
[null,null,null,null,null,null,null,null,null,null,null,null,null,null,null,null,null,null,null,null,null,null,null,null,null,null,null,null,null,null,null,null,null,{"$f":"IF(AI416<>\"\",COUNTA($AI$2:$AI416),\"\")","v":""},null,null,null,"",null,"",null,0]
[null,null,null,null,null,null,null,null,null,null,null,null,null,null,null,null,null,null,null,null,null,null,null,null,null,null,null,null,null,null,null,null,null,{"$f":"IF(AI417<>\"\",COUNTA($AI$2:$AI417),\"\")","v":""},null,null,null,"",null,"",null,0]
[null,null,null,null,null,null,null,null,null,null,null,null,null,null,null,null,null,null,null,null,null,null,null,null,null,null,null,null,null,null,null,null,null,{"$f":"IF(AI418<>\"\",COUNTA($AI$2:$AI418),\"\")","v":""},null,null,null,"",null,"",null,0]
[null,null,null,null,null,null,null,null,null,null,null,null,null,null,null,null,null,null,null,null,null,null,null,null,null,null,null,null,null,null,null,null,null,{"$f":"IF(AI419<>\"\",COUNTA($AI$2:$AI419),\"\")","v":""},null,null,null,"",null,"",null,0]
[null,null,null,null,null,null,null,null,null,null,null,null,null,null,null,null,null,null,null,null,null,null,null,null,null,null,null,null,null,null,null,null,null,{"$f":"IF(AI420<>\"\",COUNTA($AI$2:$AI420),\"\")","v":""},null,null,null,"",null,"",null,0]
[null,null,null,null,null,null,null,null,null,null,null,null,null,null,null,null,null,null,null,null,null,null,null,null,null,null,null,null,null,null,null,null,null,{"$f":"IF(AI421<>\"\",COUNTA($AI$2:$AI421),\"\")","v":""},null,null,null,"",null,"",null,0]
[null,null,null,null,null,null,null,null,null,null,null,null,null,null,null,null,null,null,null,null,null,null,null,null,null,null,null,null,null,null,null,null,null,{"$f":"IF(AI422<>\"\",COUNTA($AI$2:$AI422),\"\")","v":""},null,null,null,"",null,"",null,0]
[null,null,null,null,null,null,null,null,null,null,null,null,null,null,null,null,null,null,null,null,null,null,null,null,null,null,null,null,null,null,null,null,null,{"$f":"IF(AI423<>\"\",COUNTA($AI$2:$AI423),\"\")","v":""},null,null,null,"",null,"",null,0]
[null,null,null,null,null,null,null,null,null,null,null,null,null,null,null,null,null,null,null,null,null,null,null,null,null,null,null,null,null,null,null,null,null,{"$f":"IF(AI424<>\"\",COUNTA($AI$2:$AI424),\"\")","v":""},null,null,null,"",null,"",null,0]
[null,null,null,null,null,null,null,null,null,null,null,null,null,null,null,null,null,null,null,null,null,null,null,null,null,null,null,null,null,null,null,null,null,{"$f":"IF(AI425<>\"\",COUNTA($AI$2:$AI425),\"\")","v":""},null,null,null,"",null,"",null,0]
[null,null,null,null,null,null,null,null,null,null,null,null,null,null,null,null,null,null,null,null,null,null,null,null,null,null,null,null,null,null,null,null,null,{"$f":"IF(AI426<>\"\",COUNTA($AI$2:$AI426),\"\")","v":""},null,null,null,"",null,"",null,0]
[null,null,null,null,null,null,null,null,null,null,null,null,null,null,null,null,null,null,null,null,null,null,null,null,null,null,null,null,null,null,null,null,null,{"$f":"IF(AI427<>\"\",COUNTA($AI$2:$AI427),\"\")","v":""},null,null,null,"",null,"",null,0]
[null,null,null,null,null,null,null,null,null,null,null,null,null,null,null,null,null,null,null,null,null,null,null,null,null,null,null,null,null,null,null,null,null,{"$f":"IF(AI428<>\"\",COUNTA($AI$2:$AI428),\"\")","v":""},null,null,null,"",null,"",null,0]
[null,null,null,null,null,null,null,null,null,null,null,null,null,null,null,null,null,null,null,null,null,null,null,null,null,null,null,null,null,null,null,null,null,{"$f":"IF(AI429<>\"\",COUNTA($AI$2:$AI429),\"\")","v":""},null,null,null,"",null,"",null,0]
[null,null,null,null,null,null,null,null,null,null,null,null,null,null,null,null,null,null,null,null,null,null,null,null,null,null,null,null,null,null,null,null,null,{"$f":"IF(AI430<>\"\",COUNTA($AI$2:$AI430),\"\")","v":""},null,null,null,"",null,"",null,0]
[null,null,null,null,null,null,null,null,null,null,null,null,null,null,null,null,null,null,null,null,null,null,null,null,null,null,null,null,null,null,null,null,null,{"$f":"IF(AI431<>\"\",COUNTA($AI$2:$AI431),\"\")","v":""},null,null,null,"",null,"",null,0]
[null,null,null,null,null,null,null,null,null,null,null,null,null,null,null,null,null,null,null,null,null,null,null,null,null,null,null,null,null,null,null,null,null,{"$f":"IF(AI432<>\"\",COUNTA($AI$2:$AI432),\"\")","v":""},null,null,null,"",null,"",null,0]
[null,null,null,null,null,null,null,null,null,null,null,null,null,null,null,null,null,null,null,null,null,null,null,null,null,null,null,null,null,null,null,null,null,{"$f":"IF(AI433<>\"\",COUNTA($AI$2:$AI433),\"\")","v":""},null,null,null,"",null,"",null,0]
[null,null,null,null,null,null,null,null,null,null,null,null,null,null,null,null,null,null,null,null,null,null,null,null,null,null,null,null,null,null,null,null,null,{"$f":"IF(AI434<>\"\",COUNTA($AI$2:$AI434),\"\")","v":""},null,null,null,"",null,"",null,0]
[null,null,null,null,null,null,null,null,null,null,null,null,null,null,null,null,null,null,null,null,null,null,null,null,null,null,null,null,null,null,null,null,null,{"$f":"IF(AI435<>\"\",COUNTA($AI$2:$AI435),\"\")","v":""},null,null,null,"",null,"",null,0]
[null,null,null,null,null,null,null,null,null,null,null,null,null,null,null,null,null,null,null,null,null,null,null,null,null,null,null,null,null,null,null,null,null,{"$f":"IF(AI436<>\"\",COUNTA($AI$2:$AI436),\"\")","v":""},null,null,null,"",null,"",null,0]
[null,null,null,null,null,null,null,null,null,null,null,null,null,null,null,null,null,null,null,null,null,null,null,null,null,null,null,null,null,null,null,null,null,{"$f":"IF(AI437<>\"\",COUNTA($AI$2:$AI437),\"\")","v":""},null,null,null,"",null,"",null,0]
[null,null,null,null,null,null,null,null,null,null,null,null,null,null,null,null,null,null,null,null,null,null,null,null,null,null,null,null,null,null,null,null,null,{"$f":"IF(AI438<>\"\",COUNTA($AI$2:$AI438),\"\")","v":""},null,null,null,"",null,"",null,0]
[null,null,null,null,null,null,null,null,null,null,null,null,null,null,null,null,null,null,null,null,null,null,null,null,null,null,null,null,null,null,null,null,null,{"$f":"IF(AI439<>\"\",COUNTA($AI$2:$AI439),\"\")","v":""},null,null,null,"",null,"",null,0]
[null,null,null,null,null,null,null,null,null,null,null,null,null,null,null,null,null,null,null,null,null,null,null,null,null,null,null,null,null,null,null,null,null,{"$f":"IF(AI440<>\"\",COUNTA($AI$2:$AI440),\"\")","v":""},null,null,null,"",null,"",null,0]
[null,null,null,null,null,null,null,null,null,null,null,null,null,null,null,null,null,null,null,null,null,null,null,null,null,null,null,null,null,null,null,null,null,{"$f":"IF(AI441<>\"\",COUNTA($AI$2:$AI441),\"\")","v":""},null,null,null,"",null,"",null,0]
[null,null,null,null,null,null,null,null,null,null,null,null,null,null,null,null,null,null,null,null,null,null,null,null,null,null,null,null,null,null,null,null,null,{"$f":"IF(AI442<>\"\",COUNTA($AI$2:$AI442),\"\")","v":""},null,null,null,"",null,"",null,0]
[null,null,null,null,null,null,null,null,null,null,null,null,null,null,null,null,null,null,null,null,null,null,null,null,null,null,null,null,null,null,null,null,null,{"$f":"IF(AI443<>\"\",COUNTA($AI$2:$AI443),\"\")","v":""},null,null,null,"",null,"",null,0]
[null,null,null,null,null,null,null,null,null,null,null,null,null,null,null,null,null,null,null,null,null,null,null,null,null,null,null,null,null,null,null,null,null,{"$f":"IF(AI444<>\"\",COUNTA($AI$2:$AI444),\"\")","v":""},null,null,null,"",null,"",null,0]
[null,null,null,null,null,null,null,null,null,null,null,null,null,null,null,null,null,null,null,null,null,null,null,null,null,null,null,null,null,null,null,null,null,{"$f":"IF(AI445<>\"\",COUNTA($AI$2:$AI445),\"\")","v":""},null,null,null,"",null,"",null,0]
[null,null,null,null,null,null,null,null,null,null,null,null,null,null,null,null,null,null,null,null,null,null,null,null,null,null,null,null,null,null,null,null,null,{"$f":"IF(AI446<>\"\",COUNTA($AI$2:$AI446),\"\")","v":""},null,null,null,"",null,"",null,0]
[null,null,null,null,null,null,null,null,null,null,null,null,null,null,null,null,null,null,null,null,null,null,null,null,null,null,null,null,null,null,null,null,null,{"$f":"IF(AI447<>\"\",COUNTA($AI$2:$AI447),\"\")","v":""},null,null,null,"",null,"",null,0]
[null,null,null,null,null,null,null,null,null,null,null,null,null,null,null,null,null,null,null,null,null,null,null,null,null,null,null,null,null,null,null,null,null,{"$f":"IF(AI448<>\"\",COUNTA($AI$2:$AI448),\"\")","v":""},null,null,null,"",null,"",null,0]
[null,null,null,null,null,null,null,null,null,null,null,null,null,null,null,null,null,null,null,null,null,null,null,null,null,null,null,null,null,null,null,null,null,{"$f":"IF(AI449<>\"\",COUNTA($AI$2:$AI449),\"\")","v":""},null,null,null,"",null,"",null,0]
[null,null,null,null,null,null,null,null,null,null,null,null,null,null,null,null,null,null,null,null,null,null,null,null,null,null,null,null,null,null,null,null,null,{"$f":"IF(AI450<>\"\",COUNTA($AI$2:$AI450),\"\")","v":""},null,null,null,{"$f":"IFERROR(IF(AI450=\"\",\"\",IF(AJ450=\"gesetzt\",RAND()*5000000,RAND()*1000*20)),\"\")","v":""},null,"",null,0]
[null,null,null,null,null,null,null,null,null,null,null,null,null,null,null,null,null,null,null,null,null,null,null,null,null,null,null,null,null,null,null,null,null,{"$f":"IF(AI451<>\"\",COUNTA($AI$2:$AI451),\"\")","v":""},null,null,null,"",null,{"$f":"IF(AJ451=\"\",\"\",AJ451)","v":""},null,{"$f":"IF(AN451=\"gesetzt\",1,0)","v":0}]
[null,null,null,null,null,null,null,null,null,null,null,null,null,null,null,null,null,null,null,null,null,null,null,null,null,null,null,null,null,null,null,null,null,{"$f":"IF(AI452<>\"\",COUNTA($AI$2:$AI452),\"\")","v":""},null,null,null,"",null,"",null,0]
[null,null,null,null,null,null,null,null,null,null,null,null,null,null,null,null,null,null,null,null,null,null,null,null,null,null,null,null,null,null,null,null,null,{"$f":"IF(AI453<>\"\",COUNTA($AI$2:$AI453),\"\")","v":""},null,null,null,"",null,"",null,0]
[null,null,null,null,null,null,null,null,null,null,null,null,null,null,null,null,null,null,null,null,null,null,null,null,null,null,null,null,null,null,null,null,null,{"$f":"IF(AI454<>\"\",COUNTA($AI$2:$AI454),\"\")","v":""},null,null,null,"",null,"",null,0]
[null,null,null,null,null,null,null,null,null,null,null,null,null,null,null,null,null,null,null,null,null,null,null,null,null,null,null,null,null,null,null,null,null,{"$f":"IF(AI455<>\"\",COUNTA($AI$2:$AI455),\"\")","v":""},null,null,null,"",null,"",null,0]
[null,null,null,null,null,null,null,null,null,null,null,null,null,null,null,null,null,null,null,null,null,null,null,null,null,null,null,null,null,null,null,null,null,{"$f":"IF(AI456<>\"\",COUNTA($AI$2:$AI456),\"\")","v":""},null,null,null,"",null,"",null,0]
[null,null,null,null,null,null,null,null,null,null,null,null,null,null,null,null,null,null,null,null,null,null,null,null,null,null,null,null,null,null,null,null,null,{"$f":"IF(AI457<>\"\",COUNTA($AI$2:$AI457),\"\")","v":""},null,null,null,"",null,"",null,0]
[null,null,null,null,null,null,null,null,null,null,null,null,null,null,null,null,null,null,null,null,null,null,null,null,null,null,null,null,null,null,null,null,null,{"$f":"IF(AI458<>\"\",COUNTA($AI$2:$AI458),\"\")","v":""},null,null,null,"",null,"",null,0]
[null,null,null,null,null,null,null,null,null,null,null,null,null,null,null,null,null,null,null,null,null,null,null,null,null,null,null,null,null,null,null,null,null,{"$f":"IF(AI459<>\"\",COUNTA($AI$2:$AI459),\"\")","v":""},null,null,null,"",null,"",null,0]
[null,null,null,null,null,null,null,null,null,null,null,null,null,null,null,null,null,null,null,null,null,null,null,null,null,null,null,null,null,null,null,null,null,{"$f":"IF(AI460<>\"\",COUNTA($AI$2:$AI460),\"\")","v":""},null,null,null,"",null,"",null,0]
[null,null,null,null,null,null,null,null,null,null,null,null,null,null,null,null,null,null,null,null,null,null,null,null,null,null,null,null,null,null,null,null,null,{"$f":"IF(AI461<>\"\",COUNTA($AI$2:$AI461),\"\")","v":""},null,null,null,"",null,"",null,0]
[null,null,null,null,null,null,null,null,null,null,null,null,null,null,null,null,null,null,null,null,null,null,null,null,null,null,null,null,null,null,null,null,null,{"$f":"IF(AI462<>\"\",COUNTA($AI$2:$AI462),\"\")","v":""},null,null,null,"",null,"",null,0]
[null,null,null,null,null,null,null,null,null,null,null,null,null,null,null,null,null,null,null,null,null,null,null,null,null,null,null,null,null,null,null,null,null,{"$f":"IF(AI463<>\"\",COUNTA($AI$2:$AI463),\"\")","v":""},null,null,null,"",null,"",null,0]
[null,null,null,null,null,null,null,null,null,null,null,null,null,null,null,null,null,null,null,null,null,null,null,null,null,null,null,null,null,null,null,null,null,{"$f":"IF(AI464<>\"\",COUNTA($AI$2:$AI464),\"\")","v":""},null,null,null,"",null,"",null,0]
[null,null,null,null,null,null,null,null,null,null,null,null,null,null,null,null,null,null,null,null,null,null,null,null,null,null,null,null,null,null,null,null,null,{"$f":"IF(AI465<>\"\",COUNTA($AI$2:$AI465),\"\")","v":""},null,null,null,"",null,"",null,0]
[null,null,null,null,null,null,null,null,null,null,null,null,null,null,null,null,null,null,null,null,null,null,null,null,null,null,null,null,null,null,null,null,null,{"$f":"IF(AI466<>\"\",COUNTA($AI$2:$AI466),\"\")","v":""},null,null,null,"",null,"",null,0]
[null,null,null,null,null,null,null,null,null,null,null,null,null,null,null,null,null,null,null,null,null,null,null,null,null,null,null,null,null,null,null,null,null,{"$f":"IF(AI467<>\"\",COUNTA($AI$2:$AI467),\"\")","v":""},null,null,null,"",null,"",null,0]
[null,null,null,null,null,null,null,null,null,null,null,null,null,null,null,null,null,null,null,null,null,null,null,null,null,null,null,null,null,null,null,null,null,{"$f":"IF(AI468<>\"\",COUNTA($AI$2:$AI468),\"\")","v":""},null,null,null,"",null,"",null,0]
[null,null,null,null,null,null,null,null,null,null,null,null,null,null,null,null,null,null,null,null,null,null,null,null,null,null,null,null,null,null,null,null,null,{"$f":"IF(AI469<>\"\",COUNTA($AI$2:$AI469),\"\")","v":""},null,null,null,"",null,"",null,0]
[null,null,null,null,null,null,null,null,null,null,null,null,null,null,null,null,null,null,null,null,null,null,null,null,null,null,null,null,null,null,null,null,null,{"$f":"IF(AI470<>\"\",COUNTA($AI$2:$AI470),\"\")","v":""},null,null,null,"",null,"",null,0]
[null,null,null,null,null,null,null,null,null,null,null,null,null,null,null,null,null,null,null,null,null,null,null,null,null,null,null,null,null,null,null,null,null,{"$f":"IF(AI471<>\"\",COUNTA($AI$2:$AI471),\"\")","v":""},null,null,null,"",null,"",null,0]
[null,null,null,null,null,null,null,null,null,null,null,null,null,null,null,null,null,null,null,null,null,null,null,null,null,null,null,null,null,null,null,null,null,{"$f":"IF(AI472<>\"\",COUNTA($AI$2:$AI472),\"\")","v":""},null,null,null,"",null,"",null,0]
[null,null,null,null,null,null,null,null,null,null,null,null,null,null,null,null,null,null,null,null,null,null,null,null,null,null,null,null,null,null,null,null,null,{"$f":"IF(AI473<>\"\",COUNTA($AI$2:$AI473),\"\")","v":""},null,null,null,"",null,"",null,0]
[null,null,null,null,null,null,null,null,null,null,null,null,null,null,null,null,null,null,null,null,null,null,null,null,null,null,null,null,null,null,null,null,null,{"$f":"IF(AI474<>\"\",COUNTA($AI$2:$AI474),\"\")","v":""},null,null,null,"",null,"",null,0]
[null,null,null,null,null,null,null,null,null,null,null,null,null,null,null,null,null,null,null,null,null,null,null,null,null,null,null,null,null,null,null,null,null,{"$f":"IF(AI475<>\"\",COUNTA($AI$2:$AI475),\"\")","v":""},null,null,null,"",null,"",null,0]
[null,null,null,null,null,null,null,null,null,null,null,null,null,null,null,null,null,null,null,null,null,null,null,null,null,null,null,null,null,null,null,null,null,{"$f":"IF(AI476<>\"\",COUNTA($AI$2:$AI476),\"\")","v":""},null,null,null,"",null,"",null,0]
[null,null,null,null,null,null,null,null,null,null,null,null,null,null,null,null,null,null,null,null,null,null,null,null,null,null,null,null,null,null,null,null,null,{"$f":"IF(AI477<>\"\",COUNTA($AI$2:$AI477),\"\")","v":""},null,null,null,"",null,"",null,0]
[null,null,null,null,null,null,null,null,null,null,null,null,null,null,null,null,null,null,null,null,null,null,null,null,null,null,null,null,null,null,null,null,null,{"$f":"IF(AI478<>\"\",COUNTA($AI$2:$AI478),\"\")","v":""},null,null,null,"",null,"",null,0]
[null,null,null,null,null,null,null,null,null,null,null,null,null,null,null,null,null,null,null,null,null,null,null,null,null,null,null,null,null,null,null,null,null,{"$f":"IF(AI479<>\"\",COUNTA($AI$2:$AI479),\"\")","v":""},null,null,null,"",null,"",null,0]
[null,null,null,null,null,null,null,null,null,null,null,null,null,null,null,null,null,null,null,null,null,null,null,null,null,null,null,null,null,null,null,null,null,{"$f":"IF(AI480<>\"\",COUNTA($AI$2:$AI480),\"\")","v":""},null,null,null,"",null,"",null,0]
[null,null,null,null,null,null,null,null,null,null,null,null,null,null,null,null,null,null,null,null,null,null,null,null,null,null,null,null,null,null,null,null,null,{"$f":"IF(AI481<>\"\",COUNTA($AI$2:$AI481),\"\")","v":""},null,null,null,"",null,"",null,0]
[null,null,null,null,null,null,null,null,null,null,null,null,null,null,null,null,null,null,null,null,null,null,null,null,null,null,null,null,null,null,null,null,null,{"$f":"IF(AI482<>\"\",COUNTA($AI$2:$AI482),\"\")","v":""},null,null,null,"",null,"",null,0]
[null,null,null,null,null,null,null,null,null,null,null,null,null,null,null,null,null,null,null,null,null,null,null,null,null,null,null,null,null,null,null,null,null,{"$f":"IF(AI483<>\"\",COUNTA($AI$2:$AI483),\"\")","v":""},null,null,null,"",null,"",null,0]
[null,null,null,null,null,null,null,null,null,null,null,null,null,null,null,null,null,null,null,null,null,null,null,null,null,null,null,null,null,null,null,null,null,{"$f":"IF(AI484<>\"\",COUNTA($AI$2:$AI484),\"\")","v":""},null,null,null,"",null,"",null,0]
[null,null,null,null,null,null,null,null,null,null,null,null,null,null,null,null,null,null,null,null,null,null,null,null,null,null,null,null,null,null,null,null,null,{"$f":"IF(AI485<>\"\",COUNTA($AI$2:$AI485),\"\")","v":""},null,null,null,"",null,"",null,0]
[null,null,null,null,null,null,null,null,null,null,null,null,null,null,null,null,null,null,null,null,null,null,null,null,null,null,null,null,null,null,null,null,null,{"$f":"IF(AI486<>\"\",COUNTA($AI$2:$AI486),\"\")","v":""},null,null,null,"",null,"",null,0]
[null,null,null,null,null,null,null,null,null,null,null,null,null,null,null,null,null,null,null,null,null,null,null,null,null,null,null,null,null,null,null,null,null,{"$f":"IF(AI487<>\"\",COUNTA($AI$2:$AI487),\"\")","v":""},null,null,null,"",null,"",null,0]
[null,null,null,null,null,null,null,null,null,null,null,null,null,null,null,null,null,null,null,null,null,null,null,null,null,null,null,null,null,null,null,null,null,{"$f":"IF(AI488<>\"\",COUNTA($AI$2:$AI488),\"\")","v":""},null,null,null,"",null,"",null,0]
[null,null,null,null,null,null,null,null,null,null,null,null,null,null,null,null,null,null,null,null,null,null,null,null,null,null,null,null,null,null,null,null,null,{"$f":"IF(AI489<>\"\",COUNTA($AI$2:$AI489),\"\")","v":""},null,null,null,"",null,"",null,0]
[null,null,null,null,null,null,null,null,null,null,null,null,null,null,null,null,null,null,null,null,null,null,null,null,null,null,null,null,null,null,null,null,null,{"$f":"IF(AI490<>\"\",COUNTA($AI$2:$AI490),\"\")","v":""},null,null,null,"",null,"",null,0]
[null,null,null,null,null,null,null,null,null,null,null,null,null,null,null,null,null,null,null,null,null,null,null,null,null,null,null,null,null,null,null,null,null,{"$f":"IF(AI491<>\"\",COUNTA($AI$2:$AI491),\"\")","v":""},null,null,null,"",null,"",null,0]
[null,null,null,null,null,null,null,null,null,null,null,null,null,null,null,null,null,null,null,null,null,null,null,null,null,null,null,null,null,null,null,null,null,{"$f":"IF(AI492<>\"\",COUNTA($AI$2:$AI492),\"\")","v":""},null,null,null,"",null,"",null,0]
[null,null,null,null,null,null,null,null,null,null,null,null,null,null,null,null,null,null,null,null,null,null,null,null,null,null,null,null,null,null,null,null,null,{"$f":"IF(AI493<>\"\",COUNTA($AI$2:$AI493),\"\")","v":""},null,null,null,"",null,"",null,0]
[null,null,null,null,null,null,null,null,null,null,null,null,null,null,null,null,null,null,null,null,null,null,null,null,null,null,null,null,null,null,null,null,null,{"$f":"IF(AI494<>\"\",COUNTA($AI$2:$AI494),\"\")","v":""},null,null,null,"",null,"",null,0]
[null,null,null,null,null,null,null,null,null,null,null,null,null,null,null,null,null,null,null,null,null,null,null,null,null,null,null,null,null,null,null,null,null,{"$f":"IF(AI495<>\"\",COUNTA($AI$2:$AI495),\"\")","v":""},null,null,null,"",null,"",null,0]
[null,null,null,null,null,null,null,null,null,null,null,null,null,null,null,null,null,null,null,null,null,null,null,null,null,null,null,null,null,null,null,null,null,{"$f":"IF(AI496<>\"\",COUNTA($AI$2:$AI496),\"\")","v":""},null,null,null,"",null,"",null,0]
[null,null,null,null,null,null,null,null,null,null,null,null,null,null,null,null,null,null,null,null,null,null,null,null,null,null,null,null,null,null,null,null,null,{"$f":"IF(AI497<>\"\",COUNTA($AI$2:$AI497),\"\")","v":""},null,null,null,"",null,"",null,0]
[null,null,null,null,null,null,null,null,null,null,null,null,null,null,null,null,null,null,null,null,null,null,null,null,null,null,null,null,null,null,null,null,null,{"$f":"IF(AI498<>\"\",COUNTA($AI$2:$AI498),\"\")","v":""},null,null,null,"",null,"",null,0]
[null,null,null,null,null,null,null,null,null,null,null,null,null,null,null,null,null,null,null,null,null,null,null,null,null,null,null,null,null,null,null,null,null,{"$f":"IF(AI499<>\"\",COUNTA($AI$2:$AI499),\"\")","v":""},null,null,null,"",null,"",null,0]
[null,null,null,null,null,null,null,null,null,null,null,null,null,null,null,null,null,null,null,null,null,null,null,null,null,null,null,null,null,null,null,null,null,{"$f":"IF(AI500<>\"\",COUNTA($AI$2:$AI500),\"\")","v":""},null,null,null,"",null,"",null,0]
[null,null,null,null,null,null,null,null,null,null,null,null,null,null,null,null,null,null,null,null,null,null,null,null,null,null,null,null,null,null,null,null,null,{"$f":"LARGE(AH2:AH500,1)","v":{"$error":"#NUM!"}},null,null,null,null,null,null,null,{"$f":"SUM(AP2:AP500)","v":0}]

{"sheet":"1. Runde Gruppen","index":2,"n_rows":79,"n_cols":34,"rows_kept":79,"cut":false,"hidden":false,"merged":[[0,1,0,14],[8,1,8,14],[16,1,16,14],[24,1,24,14],[0,17,0,30],[8,17,8,30],[16,17,16,30],[24,17,24,30]]}
[null,"GRUPPE A",null,null,null,null,null,null,null,null,null,null,null,null,null,null,null,"GRUPPE B"]
[{"$f":"IF(AND(CB2=\"\",R2=\"\"),1,0)","v":0},{"$f":"IF(D3=\"\",0,1)","v":0},null,{"$f":"Berechnung!D1","v":"Spieler"},{"$f":"Berechnung!E1","v":"M"},{"$f":"Berechnung!F1","v":"W"},{"$f":"Berechnung!G1","v":"L"},"D",{"$f":"Berechnung!H1","v":"F+"},{"$f":"Berechnung!I1","v":"F-"},{"$f":"Berechnung!K1","v":0},{"$f":"Berechnung!L1","v":0},{"$f":"Berechnung!M1","v":"Rang"},{"$f":"Berechnung!N1","v":"Rang"},{"$f":"Berechnung!O1","v":"P+"},null,null,{"$f":"IF(T3=\"\",0,1)","v":0},null,{"$f":"Berechnung!D12","v":"Spieler"},{"$f":"Berechnung!E12","v":"M"},{"$f":"Berechnung!F12","v":"W"},{"$f":"Berechnung!G12","v":"L"},"D","F+","F-",{"$f":"Berechnung!K12","v":0},{"$f":"Berechnung!L12","v":0},{"$f":"Berechnung!M12","v":"Rang"},{"$f":"Berechnung!N12","v":"Rang"},{"$f":"Berechnung!O12","v":"P+"},null,null,"   speichert unter C:\\Users\\Public\\Videos"]
[{"$f":"IF(AND(B3=\"\",R3=\"\"),1,0)","v":1},{"$f":"IF(D3=\"\",\"\",Berechnung!B2)","v":""},{"$f":"Berechnung!C2","v":"A1"},{"$f":"IFERROR(VLOOKUP(C3,Spieler!$I$2:$J$41,2,FALSE),\"\")","v":""},{"$f":"Berechnung!E2","v":0},{"$f":"Berechnung!F2","v":0},{"$f":"Berechnung!G2","v":0},{"$f":"Berechnung!J2","v":0},{"$f":"Berechnung!H2","v":0},{"$f":"Berechnung!I2","v":0},{"$f":"Berechnung!K2","v":0},{"$f":"Berechnung!L2","v":0},{"$f":"Berechnung!M2","v":-200000},{"$f":"Berechnung!N2","v":""},null,{"$f":"D3","v":""},155,{"$f":"IF(T3=\"\",\"\",Berechnung!B13)","v":""},{"$f":"Berechnung!C13","v":"B1"},{"$f":"IFERROR(VLOOKUP(S3,Spieler!$I$2:$J$41,2,FALSE),\"\")","v":""},{"$f":"Berechnung!E13","v":0},{"$f":"Berechnung!F13","v":0},{"$f":"Berechnung!G13","v":0},{"$f":"Berechnung!J13","v":0},{"$f":"Berechnung!H13","v":0},{"$f":"Berechnung!I13","v":0},{"$f":"Berechnung!K13","v":0},{"$f":"Berechnung!L13","v":0},{"$f":"Berechnung!M13","v":-200000},{"$f":"Berechnung!N13","v":""},null,{"$f":"T3","v":""}]
[{"$f":"IF(AND(B4=\"\",R4=\"\"),1,0)","v":1},{"$f":"IF(D4=\"\",\"\",Berechnung!B3)","v":""},{"$f":"Berechnung!C3","v":"A2"},{"$f":"IFERROR(VLOOKUP(C4,Spieler!$I$2:$J$41,2,FALSE),\"\")","v":""},{"$f":"Berechnung!E3","v":0},{"$f":"Berechnung!F3","v":0},{"$f":"Berechnung!G3","v":0},{"$f":"Berechnung!J3","v":0},{"$f":"Berechnung!H3","v":0},{"$f":"Berechnung!I3","v":0},{"$f":"Berechnung!K3","v":0},{"$f":"Berechnung!L3","v":0},{"$f":"Berechnung!M3","v":-200000},{"$f":"Berechnung!N3","v":""},null,{"$f":"D4","v":""},null,{"$f":"IF(T4=\"\",\"\",Berechnung!B14)","v":""},{"$f":"Berechnung!C14","v":"B2"},{"$f":"IFERROR(VLOOKUP(S4,Spieler!$I$2:$J$41,2,FALSE),\"\")","v":""},{"$f":"Berechnung!E14","v":0},{"$f":"Berechnung!F14","v":0},{"$f":"Berechnung!G14","v":0},{"$f":"Berechnung!J14","v":0},{"$f":"Berechnung!H14","v":0},{"$f":"Berechnung!I14","v":0},{"$f":"Berechnung!K14","v":0},{"$f":"Berechnung!L14","v":0},{"$f":"Berechnung!M14","v":-200000},{"$f":"Berechnung!N14","v":""},null,{"$f":"T4","v":""}]
[{"$f":"IF(AND(B5=\"\",R5=\"\"),1,0)","v":1},{"$f":"IF(D5=\"\",\"\",Berechnung!B4)","v":""},{"$f":"Berechnung!C4","v":"A3"},{"$f":"IFERROR(VLOOKUP(C5,Spieler!$I$2:$J$41,2,FALSE),\"\")","v":""},{"$f":"Berechnung!E4","v":0},{"$f":"Berechnung!F4","v":0},{"$f":"Berechnung!G4","v":0},{"$f":"Berechnung!J4","v":0},{"$f":"Berechnung!H4","v":0},{"$f":"Berechnung!I4","v":0},{"$f":"Berechnung!K4","v":0},{"$f":"Berechnung!L4","v":0},{"$f":"Berechnung!M4","v":-200000},{"$f":"Berechnung!N4","v":""},null,{"$f":"D5","v":""},null,{"$f":"IF(T5=\"\",\"\",Berechnung!B15)","v":""},{"$f":"Berechnung!C15","v":"B3"},{"$f":"IFERROR(VLOOKUP(S5,Spieler!$I$2:$J$41,2,FALSE),\"\")","v":""},{"$f":"Berechnung!E15","v":0},{"$f":"Berechnung!F15","v":0},{"$f":"Berechnung!G15","v":0},{"$f":"Berechnung!J15","v":0},{"$f":"Berechnung!H15","v":0},{"$f":"Berechnung!I15","v":0},{"$f":"Berechnung!K15","v":0},{"$f":"Berechnung!L15","v":0},{"$f":"Berechnung!M15","v":-200000},{"$f":"Berechnung!N15","v":""},null,{"$f":"T5","v":""}]
[{"$f":"IF(AND(B6=\"\",R6=\"\"),1,0)","v":1},{"$f":"IF(D6=\"\",\"\",Berechnung!B5)","v":""},{"$f":"Berechnung!C5","v":"A4"},{"$f":"IFERROR(VLOOKUP(C6,Spieler!$I$2:$J$41,2,FALSE),\"\")","v":""},{"$f":"Berechnung!E5","v":0},{"$f":"Berechnung!F5","v":0},{"$f":"Berechnung!G5","v":0},{"$f":"Berechnung!J5","v":0},{"$f":"Berechnung!H5","v":0},{"$f":"Berechnung!I5","v":0},{"$f":"Berechnung!K5","v":0},{"$f":"Berechnung!L5","v":0},{"$f":"Berechnung!M5","v":-200000},{"$f":"Berechnung!N5","v":""},null,{"$f":"D6","v":""},null,{"$f":"IF(T6=\"\",\"\",Berechnung!B16)","v":""},{"$f":"Berechnung!C16","v":"B4"},{"$f":"IFERROR(VLOOKUP(S6,Spieler!$I$2:$J$41,2,FALSE),\"\")","v":""},{"$f":"Berechnung!E16","v":0},{"$f":"Berechnung!F16","v":0},{"$f":"Berechnung!G16","v":0},{"$f":"Berechnung!J16","v":0},{"$f":"Berechnung!H16","v":0},{"$f":"Berechnung!I16","v":0},{"$f":"Berechnung!K16","v":0},{"$f":"Berechnung!L16","v":0},{"$f":"Berechnung!M16","v":-200000},{"$f":"Berechnung!N16","v":""},null,{"$f":"T6","v":""}]
[{"$f":"IF(AND(B7=\"\",R7=\"\"),1,0)","v":1},{"$f":"IF(D7=\"\",\"\",Berechnung!B6)","v":""},{"$f":"Berechnung!C6","v":"A5"},{"$f":"IFERROR(VLOOKUP(C7,Spieler!$I$2:$J$41,2,FALSE),\"\")","v":""},{"$f":"Berechnung!E6","v":0},{"$f":"Berechnung!F6","v":0},{"$f":"Berechnung!G6","v":0},{"$f":"Berechnung!J6","v":0},{"$f":"Berechnung!H6","v":0},{"$f":"Berechnung!I6","v":0},{"$f":"Berechnung!K6","v":0},{"$f":"Berechnung!L6","v":0},{"$f":"Berechnung!M6","v":-200000},{"$f":"Berechnung!N6","v":""},null,{"$f":"D7","v":""},null,{"$f":"IF(T7=\"\",\"\",Berechnung!B17)","v":""},{"$f":"Berechnung!C17","v":"B5"},{"$f":"IFERROR(VLOOKUP(S7,Spieler!$I$2:$J$41,2,FALSE),\"\")","v":""},{"$f":"Berechnung!E17","v":0},{"$f":"Berechnung!F17","v":0},{"$f":"Berechnung!G17","v":0},{"$f":"Berechnung!J17","v":0},{"$f":"Berechnung!H17","v":0},{"$f":"Berechnung!I17","v":0},{"$f":"Berechnung!K17","v":0},{"$f":"Berechnung!L17","v":0},{"$f":"Berechnung!M17","v":-200000},{"$f":"Berechnung!N17","v":""},null,{"$f":"T7","v":""}]
[]
[0,"GRUPPE C",null,null,null,null,null,null,null,null,null,null,null,null,null,null,"aktualisiert um:","GRUPPE D"]
[0,{"$f":"IF(D11=\"\",0,1)","v":0},null,{"$f":"Berechnung!D23","v":"Spieler"},{"$f":"Berechnung!E23","v":"M"},{"$f":"Berechnung!F23","v":"W"},{"$f":"Berechnung!G23","v":"L"},"D","F+","F-",{"$f":"Berechnung!K23","v":0},{"$f":"Berechnung!L23","v":0},{"$f":"Berechnung!M23","v":"Rang"},{"$f":"Berechnung!N23","v":"Rang"},{"$f":"Berechnung!O23","v":"P+"},null,{"$f":"NOW()-TODAY()","v":"13:34:06.850"},{"$f":"IF(T11=\"\",0,1)","v":0},null,{"$f":"Berechnung!D34","v":"Spieler"},{"$f":"Berechnung!E34","v":"M"},{"$f":"Berechnung!F34","v":"W"},{"$f":"Berechnung!G34","v":"L"},"D","F+","F-",{"$f":"Berechnung!K34","v":0},{"$f":"Berechnung!L34","v":0},{"$f":"Berechnung!M34","v":"Rang"},{"$f":"Berechnung!N34","v":"Rang"},{"$f":"Berechnung!O34","v":"P+"}]
[1,{"$f":"IF(D11=\"\",\"\",Berechnung!B24)","v":""},{"$f":"Berechnung!C24","v":"C1"},{"$f":"IFERROR(VLOOKUP(C11,Spieler!$I$2:$J$41,2,FALSE),\"\")","v":""},{"$f":"Berechnung!E24","v":0},{"$f":"Berechnung!F24","v":0},{"$f":"Berechnung!G24","v":0},{"$f":"Berechnung!J24","v":0},{"$f":"Berechnung!H24","v":0},{"$f":"Berechnung!I24","v":0},{"$f":"Berechnung!K24","v":0},{"$f":"Berechnung!L24","v":0},{"$f":"Berechnung!M24","v":-200000},{"$f":"Berechnung!N24","v":""},null,{"$f":"D11","v":""},{"$f":"IF(OR(T11=\"\",T11=0),5,0)","v":5},{"$f":"IF(T11=\"\",\"\",Berechnung!B35)","v":""},{"$f":"Berechnung!C35","v":"D1"},{"$f":"IFERROR(VLOOKUP(S11,Spieler!$I$2:$J$41,2,FALSE),\"\")","v":""},{"$f":"Berechnung!E35","v":0},{"$f":"Berechnung!F35","v":0},{"$f":"Berechnung!G35","v":0},{"$f":"Berechnung!J35","v":0},{"$f":"Berechnung!H35","v":0},{"$f":"Berechnung!I35","v":0},{"$f":"Berechnung!K35","v":0},{"$f":"Berechnung!L35","v":0},{"$f":"Berechnung!M35","v":-200000},{"$f":"Berechnung!N35","v":""},null,{"$f":"T11","v":""}]
[1,{"$f":"IF(D12=\"\",\"\",Berechnung!B25)","v":""},{"$f":"Berechnung!C25","v":"C2"},{"$f":"IFERROR(VLOOKUP(C12,Spieler!$I$2:$J$41,2,FALSE),\"\")","v":""},{"$f":"Berechnung!E25","v":0},{"$f":"Berechnung!F25","v":0},{"$f":"Berechnung!G25","v":0},{"$f":"Berechnung!J25","v":0},{"$f":"Berechnung!H25","v":0},{"$f":"Berechnung!I25","v":0},{"$f":"Berechnung!K25","v":0},{"$f":"Berechnung!L25","v":0},{"$f":"Berechnung!M25","v":-200000},{"$f":"Berechnung!N25","v":""},null,{"$f":"D12","v":""},null,{"$f":"IF(T12=\"\",\"\",Berechnung!B36)","v":""},{"$f":"Berechnung!C36","v":"D2"},{"$f":"IFERROR(VLOOKUP(S12,Spieler!$I$2:$J$41,2,FALSE),\"\")","v":""},{"$f":"Berechnung!E36","v":0},{"$f":"Berechnung!F36","v":0},{"$f":"Berechnung!G36","v":0},{"$f":"Berechnung!J36","v":0},{"$f":"Berechnung!H36","v":0},{"$f":"Berechnung!I36","v":0},{"$f":"Berechnung!K36","v":0},{"$f":"Berechnung!L36","v":0},{"$f":"Berechnung!M36","v":-200000},{"$f":"Berechnung!N36","v":""},null,{"$f":"T12","v":""}]
[1,{"$f":"IF(D13=\"\",\"\",Berechnung!B26)","v":""},{"$f":"Berechnung!C26","v":"C3"},{"$f":"IFERROR(VLOOKUP(C13,Spieler!$I$2:$J$41,2,FALSE),\"\")","v":""},{"$f":"Berechnung!E26","v":0},{"$f":"Berechnung!F26","v":0},{"$f":"Berechnung!G26","v":0},{"$f":"Berechnung!J26","v":0},{"$f":"Berechnung!H26","v":0},{"$f":"Berechnung!I26","v":0},{"$f":"Berechnung!K26","v":0},{"$f":"Berechnung!L26","v":0},{"$f":"Berechnung!M26","v":-200000},{"$f":"Berechnung!N26","v":""},null,{"$f":"D13","v":""},null,{"$f":"IF(T13=\"\",\"\",Berechnung!B37)","v":""},{"$f":"Berechnung!C37","v":"D3"},{"$f":"IFERROR(VLOOKUP(S13,Spieler!$I$2:$J$41,2,FALSE),\"\")","v":""},{"$f":"Berechnung!E37","v":0},{"$f":"Berechnung!F37","v":0},{"$f":"Berechnung!G37","v":0},{"$f":"Berechnung!J37","v":0},{"$f":"Berechnung!H37","v":0},{"$f":"Berechnung!I37","v":0},{"$f":"Berechnung!K37","v":0},{"$f":"Berechnung!L37","v":0},{"$f":"Berechnung!M37","v":-200000},{"$f":"Berechnung!N37","v":""},null,{"$f":"T13","v":""}]
[1,{"$f":"IF(D14=\"\",\"\",Berechnung!B27)","v":""},{"$f":"Berechnung!C27","v":"C4"},{"$f":"IFERROR(VLOOKUP(C14,Spieler!$I$2:$J$41,2,FALSE),\"\")","v":""},{"$f":"Berechnung!E27","v":0},{"$f":"Berechnung!F27","v":0},{"$f":"Berechnung!G27","v":0},{"$f":"Berechnung!J27","v":0},{"$f":"Berechnung!H27","v":0},{"$f":"Berechnung!I27","v":0},{"$f":"Berechnung!K27","v":0},{"$f":"Berechnung!L27","v":0},{"$f":"Berechnung!M27","v":-200000},{"$f":"Berechnung!N27","v":""},null,{"$f":"D14","v":""},null,{"$f":"IF(T14=\"\",\"\",Berechnung!B38)","v":""},{"$f":"Berechnung!C38","v":"D4"},{"$f":"IFERROR(VLOOKUP(S14,Spieler!$I$2:$J$41,2,FALSE),\"\")","v":""},{"$f":"Berechnung!E38","v":0},{"$f":"Berechnung!F38","v":0},{"$f":"Berechnung!G38","v":0},{"$f":"Berechnung!J38","v":0},{"$f":"Berechnung!H38","v":0},{"$f":"Berechnung!I38","v":0},{"$f":"Berechnung!K38","v":0},{"$f":"Berechnung!L38","v":0},{"$f":"Berechnung!M38","v":-200000},{"$f":"Berechnung!N38","v":""},null,{"$f":"T14","v":""}]
[1,{"$f":"IF(D15=\"\",\"\",Berechnung!B28)","v":""},{"$f":"Berechnung!C28","v":"C5"},{"$f":"IFERROR(VLOOKUP(C15,Spieler!$I$2:$J$41,2,FALSE),\"\")","v":""},{"$f":"Berechnung!E28","v":0},{"$f":"Berechnung!F28","v":0},{"$f":"Berechnung!G28","v":0},{"$f":"Berechnung!J28","v":0},{"$f":"Berechnung!H28","v":0},{"$f":"Berechnung!I28","v":0},{"$f":"Berechnung!K28","v":0},{"$f":"Berechnung!L28","v":0},{"$f":"Berechnung!M28","v":-200000},{"$f":"Berechnung!N28","v":""},null,{"$f":"D15","v":""},null,{"$f":"IF(T15=\"\",\"\",Berechnung!B39)","v":""},{"$f":"Berechnung!C39","v":"D5"},{"$f":"IFERROR(VLOOKUP(S15,Spieler!$I$2:$J$41,2,FALSE),\"\")","v":""},{"$f":"Berechnung!E39","v":0},{"$f":"Berechnung!F39","v":0},{"$f":"Berechnung!G39","v":0},{"$f":"Berechnung!J39","v":0},{"$f":"Berechnung!H39","v":0},{"$f":"Berechnung!I39","v":0},{"$f":"Berechnung!K39","v":0},{"$f":"Berechnung!L39","v":0},{"$f":"Berechnung!M39","v":-200000},{"$f":"Berechnung!N39","v":""},null,{"$f":"T15","v":""}]
[]
[0,"GRUPPE E",null,null,null,null,null,null,null,null,null,null,null,null,null,null,null,"GRUPPE F"]
[0,{"$f":"IF(D19=\"\",0,1)","v":0},null,{"$f":"Berechnung!D45","v":"Spieler"},{"$f":"Berechnung!E45","v":"M"},{"$f":"Berechnung!F45","v":"W"},{"$f":"Berechnung!G45","v":"L"},"D","F+","F-",{"$f":"Berechnung!K45","v":0},{"$f":"Berechnung!L45","v":0},{"$f":"Berechnung!M45","v":"Rang"},{"$f":"Berechnung!N45","v":"Rang"},{"$f":"Berechnung!O45","v":"P+"},null,null,{"$f":"IF(T19=\"\",0,1)","v":0},null,{"$f":"Berechnung!D56","v":"Spieler"},{"$f":"Berechnung!E56","v":"M"},{"$f":"Berechnung!F56","v":"W"},{"$f":"Berechnung!G56","v":"L"},"D","F+","F-",{"$f":"Berechnung!K56","v":0},{"$f":"Berechnung!L56","v":0},{"$f":"Berechnung!M56","v":"Rang"},{"$f":"Berechnung!N56","v":"Rang"},{"$f":"Berechnung!O56","v":"P+"}]
[1,{"$f":"IF(D19=\"\",\"\",Berechnung!B46)","v":""},{"$f":"Berechnung!C46","v":"E1"},{"$f":"IFERROR(VLOOKUP(C19,Spieler!$I$2:$J$41,2,FALSE),\"\")","v":""},{"$f":"Berechnung!E46","v":0},{"$f":"Berechnung!F46","v":0},{"$f":"Berechnung!G46","v":0},{"$f":"Berechnung!J46","v":0},{"$f":"Berechnung!H46","v":0},{"$f":"Berechnung!I46","v":0},{"$f":"Berechnung!K46","v":0},{"$f":"Berechnung!L46","v":0},{"$f":"Berechnung!M46","v":-200000},{"$f":"Berechnung!N46","v":""},null,{"$f":"D19","v":""},{"$f":"IF(OR(T19=\"\",T19=0),7,0)","v":7},{"$f":"IF(T19=\"\",\"\",Berechnung!B57)","v":""},{"$f":"Berechnung!C57","v":"F1"},{"$f":"IFERROR(VLOOKUP(S19,Spieler!$I$2:$J$41,2,FALSE),\"\")","v":""},{"$f":"Berechnung!E57","v":0},{"$f":"Berechnung!F57","v":0},{"$f":"Berechnung!G57","v":0},{"$f":"Berechnung!J57","v":0},{"$f":"Berechnung!H57","v":0},{"$f":"Berechnung!I57","v":0},{"$f":"Berechnung!K57","v":0},{"$f":"Berechnung!L57","v":0},{"$f":"Berechnung!M57","v":-200000},{"$f":"Berechnung!N57","v":""},null,{"$f":"T19","v":""}]
[1,{"$f":"IF(D20=\"\",\"\",Berechnung!B47)","v":""},{"$f":"Berechnung!C47","v":"E2"},{"$f":"IFERROR(VLOOKUP(C20,Spieler!$I$2:$J$41,2,FALSE),\"\")","v":""},{"$f":"Berechnung!E47","v":0},{"$f":"Berechnung!F47","v":0},{"$f":"Berechnung!G47","v":0},{"$f":"Berechnung!J47","v":0},{"$f":"Berechnung!H47","v":0},{"$f":"Berechnung!I47","v":0},{"$f":"Berechnung!K47","v":0},{"$f":"Berechnung!L47","v":0},{"$f":"Berechnung!M47","v":-200000},{"$f":"Berechnung!N47","v":""},null,{"$f":"D20","v":""},null,{"$f":"IF(T20=\"\",\"\",Berechnung!B58)","v":""},{"$f":"Berechnung!C58","v":"F2"},{"$f":"IFERROR(VLOOKUP(S20,Spieler!$I$2:$J$41,2,FALSE),\"\")","v":""},{"$f":"Berechnung!E58","v":0},{"$f":"Berechnung!F58","v":0},{"$f":"Berechnung!G58","v":0},{"$f":"Berechnung!J58","v":0},{"$f":"Berechnung!H58","v":0},{"$f":"Berechnung!I58","v":0},{"$f":"Berechnung!K58","v":0},{"$f":"Berechnung!L58","v":0},{"$f":"Berechnung!M58","v":-200000},{"$f":"Berechnung!N58","v":""},null,{"$f":"T20","v":""}]
[1,{"$f":"IF(D21=\"\",\"\",Berechnung!B48)","v":""},{"$f":"Berechnung!C48","v":"E3"},{"$f":"IFERROR(VLOOKUP(C21,Spieler!$I$2:$J$41,2,FALSE),\"\")","v":""},{"$f":"Berechnung!E48","v":0},{"$f":"Berechnung!F48","v":0},{"$f":"Berechnung!G48","v":0},{"$f":"Berechnung!J48","v":0},{"$f":"Berechnung!H48","v":0},{"$f":"Berechnung!I48","v":0},{"$f":"Berechnung!K48","v":0},{"$f":"Berechnung!L48","v":0},{"$f":"Berechnung!M48","v":-200000},{"$f":"Berechnung!N48","v":""},null,{"$f":"D21","v":""},null,{"$f":"IF(T21=\"\",\"\",Berechnung!B59)","v":""},{"$f":"Berechnung!C59","v":"F3"},{"$f":"IFERROR(VLOOKUP(S21,Spieler!$I$2:$J$41,2,FALSE),\"\")","v":""},{"$f":"Berechnung!E59","v":0},{"$f":"Berechnung!F59","v":0},{"$f":"Berechnung!G59","v":0},{"$f":"Berechnung!J59","v":0},{"$f":"Berechnung!H59","v":0},{"$f":"Berechnung!I59","v":0},{"$f":"Berechnung!K59","v":0},{"$f":"Berechnung!L59","v":0},{"$f":"Berechnung!M59","v":-200000},{"$f":"Berechnung!N59","v":""},null,{"$f":"T21","v":""}]
[1,{"$f":"IF(D22=\"\",\"\",Berechnung!B49)","v":""},{"$f":"Berechnung!C49","v":"E4"},{"$f":"IFERROR(VLOOKUP(C22,Spieler!$I$2:$J$41,2,FALSE),\"\")","v":""},{"$f":"Berechnung!E49","v":0},{"$f":"Berechnung!F49","v":0},{"$f":"Berechnung!G49","v":0},{"$f":"Berechnung!J49","v":0},{"$f":"Berechnung!H49","v":0},{"$f":"Berechnung!I49","v":0},{"$f":"Berechnung!K49","v":0},{"$f":"Berechnung!L49","v":0},{"$f":"Berechnung!M49","v":-200000},{"$f":"Berechnung!N49","v":""},null,{"$f":"D22","v":""},null,{"$f":"IF(T22=\"\",\"\",Berechnung!B60)","v":""},{"$f":"Berechnung!C60","v":"F4"},{"$f":"IFERROR(VLOOKUP(S22,Spieler!$I$2:$J$41,2,FALSE),\"\")","v":""},{"$f":"Berechnung!E60","v":0},{"$f":"Berechnung!F60","v":0},{"$f":"Berechnung!G60","v":0},{"$f":"Berechnung!J60","v":0},{"$f":"Berechnung!H60","v":0},{"$f":"Berechnung!I60","v":0},{"$f":"Berechnung!K60","v":0},{"$f":"Berechnung!L60","v":0},{"$f":"Berechnung!M60","v":-200000},{"$f":"Berechnung!N60","v":""},null,{"$f":"T22","v":""}]
[1,{"$f":"IF(D23=\"\",\"\",Berechnung!B50)","v":""},{"$f":"Berechnung!C50","v":"E5"},{"$f":"IFERROR(VLOOKUP(C23,Spieler!$I$2:$J$41,2,FALSE),\"\")","v":""},{"$f":"Berechnung!E50","v":0},{"$f":"Berechnung!F50","v":0},{"$f":"Berechnung!G50","v":0},{"$f":"Berechnung!J50","v":0},{"$f":"Berechnung!H50","v":0},{"$f":"Berechnung!I50","v":0},{"$f":"Berechnung!K50","v":0},{"$f":"Berechnung!L50","v":0},{"$f":"Berechnung!M50","v":-200000},{"$f":"Berechnung!N50","v":""},null,{"$f":"D23","v":""},null,{"$f":"IF(T23=\"\",\"\",Berechnung!B61)","v":""},{"$f":"Berechnung!C61","v":"F5"},{"$f":"IFERROR(VLOOKUP(S23,Spieler!$I$2:$J$41,2,FALSE),\"\")","v":""},{"$f":"Berechnung!E61","v":0},{"$f":"Berechnung!F61","v":0},{"$f":"Berechnung!G61","v":0},{"$f":"Berechnung!J61","v":0},{"$f":"Berechnung!H61","v":0},{"$f":"Berechnung!I61","v":0},{"$f":"Berechnung!K61","v":0},{"$f":"Berechnung!L61","v":0},{"$f":"Berechnung!M61","v":-200000},{"$f":"Berechnung!N61","v":""},null,{"$f":"T23","v":""}]
[]
[0,"GRUPPE G",null,null,null,null,null,null,null,null,null,null,null,null,null,null,null,"GRUPPE H"]
[0,{"$f":"IF(D27=\"\",0,1)","v":0},null,{"$f":"Berechnung!D67","v":"Spieler"},{"$f":"Berechnung!E67","v":"M"},{"$f":"Berechnung!F67","v":"W"},{"$f":"Berechnung!G67","v":"L"},"D","F+","F-",{"$f":"Berechnung!K67","v":0},{"$f":"Berechnung!L67","v":0},{"$f":"Berechnung!M67","v":"Rang"},{"$f":"Berechnung!N67","v":"Rang"},{"$f":"Berechnung!O67","v":"P+"},null,null,{"$f":"IF(T27=\"\",0,1)","v":0},null,{"$f":"Berechnung!D78","v":"Spieler"},{"$f":"Berechnung!E78","v":"M"},{"$f":"Berechnung!F78","v":"W"},{"$f":"Berechnung!G78","v":"L"},"D","F+","F-",{"$f":"Berechnung!K78","v":0},{"$f":"Berechnung!L78","v":0},{"$f":"Berechnung!M78","v":"Rang"},{"$f":"Berechnung!N78","v":"Rang"},{"$f":"Berechnung!O78","v":"P+"}]
[1,{"$f":"IF(D27=\"\",\"\",Berechnung!B68)","v":""},{"$f":"Berechnung!C68","v":"G1"},{"$f":"IFERROR(VLOOKUP(C27,Spieler!$I$2:$J$41,2,FALSE),\"\")","v":""},{"$f":"Berechnung!E68","v":0},{"$f":"Berechnung!F68","v":0},{"$f":"Berechnung!G68","v":0},{"$f":"Berechnung!J68","v":0},{"$f":"Berechnung!H68","v":0},{"$f":"Berechnung!I68","v":0},{"$f":"Berechnung!K68","v":0},{"$f":"Berechnung!L68","v":0},{"$f":"Berechnung!M68","v":-200000},{"$f":"Berechnung!N68","v":""},null,{"$f":"D27","v":""},{"$f":"IF(OR(T27=\"\",T27=0),9,0)","v":9},{"$f":"IF(T27=\"\",\"\",Berechnung!B79)","v":""},{"$f":"Berechnung!C79","v":"H1"},{"$f":"IFERROR(VLOOKUP(S27,Spieler!$I$2:$J$41,2,FALSE),\"\")","v":""},{"$f":"Berechnung!E79","v":0},{"$f":"Berechnung!F79","v":0},{"$f":"Berechnung!G79","v":0},{"$f":"Berechnung!J79","v":0},{"$f":"Berechnung!H79","v":0},{"$f":"Berechnung!I79","v":0},{"$f":"Berechnung!K79","v":0},{"$f":"Berechnung!L79","v":0},{"$f":"Berechnung!M79","v":-200000},{"$f":"Berechnung!N79","v":""},null,{"$f":"T27","v":""}]
[1,{"$f":"IF(D28=\"\",\"\",Berechnung!B69)","v":""},{"$f":"Berechnung!C69","v":"G2"},{"$f":"IFERROR(VLOOKUP(C28,Spieler!$I$2:$J$41,2,FALSE),\"\")","v":""},{"$f":"Berechnung!E69","v":0},{"$f":"Berechnung!F69","v":0},{"$f":"Berechnung!G69","v":0},{"$f":"Berechnung!J69","v":0},{"$f":"Berechnung!H69","v":0},{"$f":"Berechnung!I69","v":0},{"$f":"Berechnung!K69","v":0},{"$f":"Berechnung!L69","v":0},{"$f":"Berechnung!M69","v":-200000},{"$f":"Berechnung!N69","v":""},null,{"$f":"D28","v":""},null,{"$f":"IF(T28=\"\",\"\",Berechnung!B80)","v":""},{"$f":"Berechnung!C80","v":"H2"},{"$f":"IFERROR(VLOOKUP(S28,Spieler!$I$2:$J$41,2,FALSE),\"\")","v":""},{"$f":"Berechnung!E80","v":0},{"$f":"Berechnung!F80","v":0},{"$f":"Berechnung!G80","v":0},{"$f":"Berechnung!J80","v":0},{"$f":"Berechnung!H80","v":0},{"$f":"Berechnung!I80","v":0},{"$f":"Berechnung!K80","v":0},{"$f":"Berechnung!L80","v":0},{"$f":"Berechnung!M80","v":-200000},{"$f":"Berechnung!N80","v":""},null,{"$f":"T28","v":""}]
[1,{"$f":"IF(D29=\"\",\"\",Berechnung!B70)","v":""},{"$f":"Berechnung!C70","v":"G3"},{"$f":"IFERROR(VLOOKUP(C29,Spieler!$I$2:$J$41,2,FALSE),\"\")","v":""},{"$f":"Berechnung!E70","v":0},{"$f":"Berechnung!F70","v":0},{"$f":"Berechnung!G70","v":0},{"$f":"Berechnung!J70","v":0},{"$f":"Berechnung!H70","v":0},{"$f":"Berechnung!I70","v":0},{"$f":"Berechnung!K70","v":0},{"$f":"Berechnung!L70","v":0},{"$f":"Berechnung!M70","v":-200000},{"$f":"Berechnung!N70","v":""},null,{"$f":"D29","v":""},null,{"$f":"IF(T29=\"\",\"\",Berechnung!B81)","v":""},{"$f":"Berechnung!C81","v":"H3"},{"$f":"IFERROR(VLOOKUP(S29,Spieler!$I$2:$J$41,2,FALSE),\"\")","v":""},{"$f":"Berechnung!E81","v":0},{"$f":"Berechnung!F81","v":0},{"$f":"Berechnung!G81","v":0},{"$f":"Berechnung!J81","v":0},{"$f":"Berechnung!H81","v":0},{"$f":"Berechnung!I81","v":0},{"$f":"Berechnung!K81","v":0},{"$f":"Berechnung!L81","v":0},{"$f":"Berechnung!M81","v":-200000},{"$f":"Berechnung!N81","v":""},null,{"$f":"T29","v":""}]
[1,{"$f":"IF(D30=\"\",\"\",Berechnung!B71)","v":""},{"$f":"Berechnung!C71","v":"G4"},{"$f":"IFERROR(VLOOKUP(C30,Spieler!$I$2:$J$41,2,FALSE),\"\")","v":""},{"$f":"Berechnung!E71","v":0},{"$f":"Berechnung!F71","v":0},{"$f":"Berechnung!G71","v":0},{"$f":"Berechnung!J71","v":0},{"$f":"Berechnung!H71","v":0},{"$f":"Berechnung!I71","v":0},{"$f":"Berechnung!K29","v":0},{"$f":"Berechnung!L29","v":0},{"$f":"Berechnung!M71","v":-200000},{"$f":"Berechnung!N71","v":""},null,{"$f":"D30","v":""},null,{"$f":"IF(T30=\"\",\"\",Berechnung!B82)","v":""},{"$f":"Berechnung!C82","v":"H4"},{"$f":"IFERROR(VLOOKUP(S30,Spieler!$I$2:$J$41,2,FALSE),\"\")","v":""},{"$f":"Berechnung!E82","v":0},{"$f":"Berechnung!F82","v":0},{"$f":"Berechnung!G82","v":0},{"$f":"Berechnung!J82","v":0},{"$f":"Berechnung!H82","v":0},{"$f":"Berechnung!I82","v":0},{"$f":"Berechnung!K82","v":0},{"$f":"Berechnung!L82","v":0},{"$f":"Berechnung!M82","v":-200000},{"$f":"Berechnung!N82","v":""},null,{"$f":"T30","v":""}]
[1,{"$f":"IF(D31=\"\",\"\",Berechnung!B72)","v":""},{"$f":"Berechnung!C72","v":"G5"},{"$f":"IFERROR(VLOOKUP(C31,Spieler!$I$2:$J$41,2,FALSE),\"\")","v":""},{"$f":"Berechnung!E30","v":0},{"$f":"Berechnung!F30","v":0},{"$f":"Berechnung!G30","v":0},{"$f":"Berechnung!J72","v":0},{"$f":"Berechnung!H72","v":0},{"$f":"Berechnung!I72","v":0},{"$f":"Berechnung!K30","v":0},{"$f":"Berechnung!L30","v":0},{"$f":"Berechnung!M72","v":-200000},{"$f":"Berechnung!N72","v":""},null,{"$f":"D31","v":""},null,{"$f":"IF(T31=\"\",\"\",Berechnung!B83)","v":""},{"$f":"Berechnung!C83","v":"H5"},{"$f":"IFERROR(VLOOKUP(S31,Spieler!$I$2:$J$41,2,FALSE),\"\")","v":""},{"$f":"Berechnung!E83","v":0},{"$f":"Berechnung!F83","v":0},{"$f":"Berechnung!G83","v":0},{"$f":"Berechnung!J83","v":0},{"$f":"Berechnung!H83","v":0},{"$f":"Berechnung!I83","v":0},{"$f":"Berechnung!K83","v":0},{"$f":"Berechnung!L83","v":0},{"$f":"Berechnung!M83","v":-200000},{"$f":"Berechnung!N83","v":""},null,{"$f":"T31","v":""}]
[]
[]
[]
[]
[]
[]
[]
[]
[]
[]
[]
[]
[]
[]
[]
[]
[]
[]
[]
[]
[]
[]
[null,null,null,{"$f":"IFERROR(VLOOKUP(Spieler!S12,'1. Runde Gruppen'!$C$55:$D$79,2,FALSE),\"\")","v":""}]
[null,null,8,"B1:AE6"]
[null,null,9,"B1:AE7"]
[null,null,10,"B1:AE7"]
[null,null,11,"B1:AE13"]
[null,null,12,"B1:AE13"]
[null,null,13,"B1:AE13"]
[null,null,14,"B1:AE14"]
[null,null,15,"B1:AE14"]
[null,null,16,"B1:AE14"]
[null,null,17,"B1:AE14"]
[null,null,18,"B1:AE14"]
[null,null,19,"B1:AE15"]
[null,null,20,"B1:AE15"]
[null,null,21,"B1:AE21"]
[null,null,22,"B1:AE21"]
[null,null,23,"B1:AE22"]
[null,null,24,"B1:AE29"]
[null,null,25,"B1:AE29"]
[null,null,26,"B1:AE29"]
[null,null,27,"B1:AE29"]
[null,null,28,"B1:AE29"]
[null,null,29,"B1:AE29"]
[null,null,30,"B1:AE29"]
[null,null,31,"B1:AE30"]
[null,null,32,"B1:AE30"]

{"sheet":"Matches","index":3,"n_rows":112,"n_cols":47,"rows_kept":112,"cut":false,"hidden":false,"merged":[[0,16,0,19],[0,10,0,13],[0,14,0,15]]}
[{"$f":"E112","v":0},"Tisch","Nr.","Gr.","Startzeit","Endzeit","Dauer","Spieler",null,"Spieler","Break 30+",null,null,null,"Match",null,"Break 30+",null,null,null,null,null,"23:13:11","11:44:59","13:34:06",{"$f":"Y1+AA1","v":"14:29:06"},{"$f":"Spieler!AA14","v":"00:55:00"},"HB SP1",null,"Anzahl1","Anzahl2",null,"HB SP2",null,null,null,null,null,null,null,null,null,null,null,null,null,{"$f":"IFERROR(VLOOKUP(Spieler!S12,Matches!$AQ$2:$AS$26,3,FALSE),\"\")","v":""}]
[{"$f":"Berechnung!AX2","v":0},null,{"$f":"Berechnung!BH2","v":""},{"$f":"Berechnung!BF2","v":""},null,null,{"$f":"IF(F2=\"\",\"\",F2-E2)","v":""},{"$f":"Berechnung!Z2","v":""},{"$f":"IF(H2>\"\",\"v\",\"\")","v":""},{"$f":"Berechnung!AA2","v":""},null,null,null,null,null,null,null,null,null,null,null,null,null,null,null,{"$f":"IF(E2=\"\",\"\",IF(AND(E2>\"\",O2+P2>1),3,IF(O2+P2>=2,3,IF($Y$1>AA2,1,0))))","v":""},{"$f":"IF(E2=\"\",\"\",E2+$AA$1)","v":""},{"$f":"IFERROR(LARGE(K2:N2,1),\"\")","v":""},{"$f":"H2","v":""},{"$f":"IF(K2>0,1)+IF(L2>0,1)+IF(M2>0,1)+IF(N2>0,1)","v":0},{"$f":"IF(Q2>0,1)+IF(R2>0,1)+IF(S2>0,1)+IF(T2>0,1)","v":0},null,{"$f":"IFERROR(LARGE(Q2:T2,1),\"\")","v":""},{"$f":"J2","v":""},null,null,"speichert unter C:\\Users\\Public\\Videos",null,null,null,null,null,8,12,"B1:T13"]
[{"$f":"Berechnung!AX3","v":0},null,{"$f":"Berechnung!BH3","v":""},{"$f":"Berechnung!BF3","v":""},null,null,{"$f":"IF(F3=\"\",\"\",F3-E3)","v":""},{"$f":"Berechnung!Z3","v":""},{"$f":"IF(H3>\"\",\"v\",\"\")","v":""},{"$f":"Berechnung!AA3","v":""},null,null,null,null,null,null,null,null,null,null,null,null,null,null,null,"","","","",0,{"$f":"IF(Q3>0,1)+IF(R3>0,1)+IF(S3>0,1)+IF(T3>0,1)","v":0},null,"","",null,null,null,null,null,null,null,null,9,16,"B1:T17"]
[{"$f":"Berechnung!AX4","v":0},null,{"$f":"Berechnung!BH4","v":""},{"$f":"Berechnung!BF4","v":""},null,null,{"$f":"IF(F4=\"\",\"\",F4-E4)","v":""},{"$f":"Berechnung!Z4","v":""},"",{"$f":"Berechnung!AA4","v":""},null,null,null,null,null,null,null,null,null,null,null,null,null,null,null,"","","","",0,0,null,"","",null,null,null,null,null,null,null,null,10,20,"B1:T21"]
[{"$f":"Berechnung!AX5","v":0},null,{"$f":"Berechnung!BH5","v":""},{"$f":"Berechnung!BF5","v":""},null,null,"",{"$f":"Berechnung!Z5","v":""},"",{"$f":"Berechnung!AA5","v":""},null,null,null,null,null,null,null,null,null,null,null,null,null,null,null,"","","","",0,0,null,"","",null,null,null,null,null,null,null,null,11,15,"B1:T16"]
[{"$f":"Berechnung!AX6","v":0},null,{"$f":"Berechnung!BH6","v":""},{"$f":"Berechnung!BF6","v":""},null,null,"",{"$f":"Berechnung!Z6","v":""},"",{"$f":"Berechnung!AA6","v":""},null,null,null,null,null,null,null,null,null,null,null,null,null,null,null,"","","","",0,0,null,"","",null,null,null,null,null,null,null,null,12,12,"B1:T13"]
[{"$f":"Berechnung!AX7","v":0},null,{"$f":"Berechnung!BH7","v":""},{"$f":"Berechnung!BF7","v":""},null,null,"",{"$f":"Berechnung!Z7","v":""},"",{"$f":"Berechnung!AA7","v":""},null,null,null,null,null,null,null,null,null,null,null,null,null,null,null,"","","","",0,0,null,"","",null,null,null,null,null,null,null,null,13,15,"B1:T16"]
[{"$f":"Berechnung!AX8","v":0},null,{"$f":"Berechnung!BH8","v":""},{"$f":"Berechnung!BF8","v":""},null,null,"",{"$f":"Berechnung!Z8","v":""},"",{"$f":"Berechnung!AA8","v":""},null,null,null,null,null,null,null,null,null,null,null,null,null,null,null,"","","","",0,0,null,"","",null,null,null,null,null,null,null,null,14,18,"B1:T19"]
[{"$f":"Berechnung!AX9","v":0},null,{"$f":"Berechnung!BH9","v":""},{"$f":"Berechnung!BF9","v":""},null,null,"",{"$f":"Berechnung!Z9","v":""},"",{"$f":"Berechnung!AA9","v":""},null,null,null,null,null,null,null,null,null,null,null,null,null,null,null,"","","","",0,0,null,"","",null,null,148,"Freigabe-Code Finals",null,null,null,null,15,21,"B1:T22"]
[{"$f":"Berechnung!AX10","v":0},null,{"$f":"Berechnung!BH10","v":""},{"$f":"Berechnung!BF10","v":""},null,null,"",{"$f":"Berechnung!Z10","v":""},"",{"$f":"Berechnung!AA10","v":""},null,null,null,null,null,null,null,null,null,null,null,null,null,null,null,"","","","",0,0,null,"","",null,null,null,null,null,null,null,null,16,24,"B1:T25"]
[{"$f":"Berechnung!AX11","v":0},null,{"$f":"Berechnung!BH11","v":""},{"$f":"Berechnung!BF11","v":""},null,null,"",{"$f":"Berechnung!Z11","v":""},"",{"$f":"Berechnung!AA11","v":""},null,null,null,null,null,null,null,null,null,null,null,null,null,null,null,"","","","",0,0,null,"","",null,null,"Die Vorrunde ist abgeschlossen?",null,null,null,null,null,17,30,"B1:T29"]
[{"$f":"Berechnung!AX12","v":0},null,{"$f":"Berechnung!BH12","v":""},{"$f":"Berechnung!BF12","v":""},null,null,"",{"$f":"Berechnung!Z12","v":""},"",{"$f":"Berechnung!AA12","v":""},null,null,null,null,null,null,null,null,null,null,null,null,null,false,false,"","","","",0,0,null,"","",null,null,"Haken setzen!",null,null,null,null,null,18,32,"B1:T33"]
[{"$f":"Berechnung!AX13","v":0},null,{"$f":"Berechnung!BH13","v":""},{"$f":"Berechnung!BF13","v":""},null,null,"",{"$f":"Berechnung!Z13","v":""},"",{"$f":"Berechnung!AA13","v":""},null,null,null,null,null,null,null,null,null,null,null,null,null,null,null,"","","","",0,0,null,"","",null,null,"Die Auslosung der AF oder VF erfolgt!",null,null,null,null,null,19,36,"B1:T37"]
[{"$f":"Berechnung!AX14","v":0},null,{"$f":"Berechnung!BH14","v":""},{"$f":"Berechnung!BF14","v":""},null,null,{"$f":"IF(F14=\"\",\"\",F14-E14)","v":""},{"$f":"Berechnung!Z14","v":""},{"$f":"IF(H14>\"\",\"v\",\"\")","v":""},{"$f":"Berechnung!AA14","v":""},null,null,null,null,null,null,null,null,null,null,null,null,null,null,null,{"$f":"IF(E14=\"\",\"\",IF(AND(E14>\"\",O14+P14>1),3,IF(O14+P14>=2,3,IF($Y$1>AA14,1,0))))","v":""},{"$f":"IF(E14=\"\",\"\",E14+$AA$1)","v":""},{"$f":"IFERROR(LARGE(K14:N14,1),\"\")","v":""},{"$f":"H14","v":""},{"$f":"IF(K14>0,1)+IF(L14>0,1)+IF(M14>0,1)+IF(N14>0,1)","v":0},{"$f":"IF(Q14>0,1)+IF(R14>0,1)+IF(S14>0,1)+IF(T14>0,1)","v":0},null,{"$f":"IFERROR(LARGE(Q14:T14,1),\"\")","v":""},{"$f":"J14","v":""},null,null,null,null,null,null,null,null,20,40,"B1:T41"]
[{"$f":"Berechnung!AX15","v":0},null,{"$f":"Berechnung!BH15","v":""},{"$f":"Berechnung!BF15","v":""},null,null,{"$f":"IF(F15=\"\",\"\",F15-E15)","v":""},{"$f":"Berechnung!Z15","v":""},{"$f":"IF(H15>\"\",\"v\",\"\")","v":""},{"$f":"Berechnung!AA15","v":""},null,null,null,null,null,null,null,null,null,null,null,null,null,null,null,{"$f":"IF(E15=\"\",\"\",IF(AND(E15>\"\",O15+P15>1),3,IF(O15+P15>=2,3,IF($Y$1>AA15,1,0))))","v":""},{"$f":"IF(E15=\"\",\"\",E15+$AA$1)","v":""},{"$f":"IFERROR(LARGE(K15:N15,1),\"\")","v":""},{"$f":"H15","v":""},{"$f":"IF(K15>0,1)+IF(L15>0,1)+IF(M15>0,1)+IF(N15>0,1)","v":0},{"$f":"IF(Q15>0,1)+IF(R15>0,1)+IF(S15>0,1)+IF(T15>0,1)","v":0},null,{"$f":"IFERROR(LARGE(Q15:T15,1),\"\")","v":""},{"$f":"J15","v":""},null,null,null,null,null,null,null,null,21,27,"B1:T28"]
[{"$f":"Berechnung!AX16","v":0},null,{"$f":"Berechnung!BH16","v":""},{"$f":"Berechnung!BF16","v":""},null,null,"",{"$f":"Berechnung!Z16","v":""},"",{"$f":"Berechnung!AA16","v":""},null,null,null,null,null,null,null,null,null,null,null,null,null,null,null,"","","","",0,0,null,"","",null,null,null,null,null,null,null,null,22,30,"B1:T31"]
[{"$f":"Berechnung!AX17","v":0},null,{"$f":"Berechnung!BH17","v":""},{"$f":"Berechnung!BF17","v":""},null,null,{"$f":"IF(F17=\"\",\"\",F17-E17)","v":""},{"$f":"Berechnung!Z17","v":""},"",{"$f":"Berechnung!AA17","v":""},null,null,null,null,null,null,null,null,null,null,null,null,null,null,null,"","","","",0,0,null,"","",null,null,null,null,null,null,null,null,23,24,"B1:T34"]
[{"$f":"Berechnung!AX18","v":0},null,{"$f":"Berechnung!BH18","v":""},{"$f":"Berechnung!BF18","v":""},null,null,"",{"$f":"Berechnung!Z18","v":""},"",{"$f":"Berechnung!AA18","v":""},null,null,null,null,null,null,null,null,null,null,null,null,null,null,null,"","","","",0,0,null,"","",null,null,null,null,null,null,null,null,24,24,"B1:T25"]
[{"$f":"Berechnung!AX19","v":0},null,{"$f":"Berechnung!BH19","v":""},{"$f":"Berechnung!BF19","v":""},null,null,"",{"$f":"Berechnung!Z19","v":""},"",{"$f":"Berechnung!AA19","v":""},null,null,null,null,null,null,null,null,null,null,null,null,null,null,null,"","","","",0,0,null,"","",null,null,null,null,null,null,null,null,25,27,"B1:T28"]
[{"$f":"Berechnung!AX20","v":0},null,{"$f":"Berechnung!BH20","v":""},{"$f":"Berechnung!BF20","v":""},null,null,"",{"$f":"Berechnung!Z20","v":""},"",{"$f":"Berechnung!AA20","v":""},null,null,null,null,null,null,null,null,null,null,null,null,null,null,null,"","","","",0,0,null,"","",null,null,null,null,null,null,null,null,26,30,"B1:T31"]
[{"$f":"Berechnung!AX21","v":0},null,{"$f":"Berechnung!BH21","v":""},{"$f":"Berechnung!BF21","v":""},null,null,"",{"$f":"Berechnung!Z21","v":""},"",{"$f":"Berechnung!AA21","v":""},null,null,null,null,null,null,null,null,null,null,null,null,null,null,null,"","","","",0,0,null,"","",null,null,null,null,null,null,null,null,27,33,"B1:T34"]
[{"$f":"Berechnung!AX22","v":0},null,{"$f":"Berechnung!BH22","v":""},{"$f":"Berechnung!BF22","v":""},null,null,"",{"$f":"Berechnung!Z22","v":""},"",{"$f":"Berechnung!AA22","v":""},null,null,null,null,null,null,null,null,null,null,null,null,null,null,null,"","","","",0,0,null,"","",null,null,null,null,null,null,null,null,28,36,"B1:T37"]
[{"$f":"Berechnung!AX23","v":0},null,{"$f":"Berechnung!BH23","v":""},{"$f":"Berechnung!BF23","v":""},null,null,"",{"$f":"Berechnung!Z23","v":""},"",{"$f":"Berechnung!AA23","v":""},null,null,null,null,null,null,null,null,null,null,null,null,null,null,null,"","","","",0,0,null,"","",null,null,null,null,null,null,null,null,29,39,"B1:T40"]
[{"$f":"Berechnung!AX24","v":0},null,{"$f":"Berechnung!BH24","v":""},{"$f":"Berechnung!BF24","v":""},null,null,"",{"$f":"Berechnung!Z24","v":""},"",{"$f":"Berechnung!AA24","v":""},null,null,null,null,null,null,null,null,null,null,null,null,null,null,null,"","","","",0,0,null,"","",null,null,null,null,null,null,null,null,30,42,"B1:T43"]
[{"$f":"Berechnung!AX25","v":0},null,{"$f":"Berechnung!BH25","v":""},{"$f":"Berechnung!BF25","v":""},null,null,"",{"$f":"Berechnung!Z25","v":""},"",{"$f":"Berechnung!AA25","v":""},null,null,null,null,null,null,null,null,null,null,null,null,null,null,null,"","","","",0,0,null,"","",null,null,null,null,null,null,null,null,31,45,"B1:T46"]
[{"$f":"Berechnung!AX26","v":0},null,{"$f":"Berechnung!BH26","v":""},{"$f":"Berechnung!BF26","v":""},null,null,"",{"$f":"Berechnung!Z26","v":""},"",{"$f":"Berechnung!AA26","v":""},null,null,null,null,null,null,null,null,null,null,null,null,null,null,null,"","","","",0,0,null,"","",null,null,null,null,null,null,null,null,32,48,"B1:T49"]
[{"$f":"Berechnung!AX27","v":0},null,{"$f":"Berechnung!BH27","v":""},{"$f":"Berechnung!BF27","v":""},null,null,"",{"$f":"Berechnung!Z27","v":""},"",{"$f":"Berechnung!AA27","v":""},null,null,null,null,null,null,null,null,null,null,null,null,null,null,null,"","","","",0,0,null,"",""]
[{"$f":"Berechnung!AX28","v":0},null,{"$f":"Berechnung!BH28","v":""},{"$f":"Berechnung!BF28","v":""},null,null,"",{"$f":"Berechnung!Z28","v":""},"",{"$f":"Berechnung!AA28","v":""},null,null,null,null,null,null,null,null,null,null,null,null,null,null,null,"","","","",0,0,null,"",""]
[{"$f":"Berechnung!AX29","v":0},null,{"$f":"Berechnung!BH29","v":""},{"$f":"Berechnung!BF29","v":""},null,null,"",{"$f":"Berechnung!Z29","v":""},"",{"$f":"Berechnung!AA29","v":""},null,null,null,null,null,null,null,null,null,null,null,null,null,null,null,"","","","",0,0,null,"",""]
[{"$f":"Berechnung!AX30","v":0},null,{"$f":"Berechnung!BH30","v":""},{"$f":"Berechnung!BF30","v":""},null,null,"",{"$f":"Berechnung!Z30","v":""},"",{"$f":"Berechnung!AA30","v":""},null,null,null,null,null,null,null,null,null,null,null,null,null,null,null,"","","","",0,0,null,"",""]
[{"$f":"Berechnung!AX31","v":0},null,{"$f":"Berechnung!BH31","v":""},{"$f":"Berechnung!BF31","v":""},null,null,"",{"$f":"Berechnung!Z31","v":""},"",{"$f":"Berechnung!AA31","v":""},null,null,null,null,null,null,null,null,null,null,null,null,null,null,null,"","","","",0,0,null,"",""]
[{"$f":"Berechnung!AX32","v":0},null,{"$f":"Berechnung!BH32","v":""},{"$f":"Berechnung!BF32","v":""},null,null,"",{"$f":"Berechnung!Z32","v":""},"",{"$f":"Berechnung!AA32","v":""},null,null,null,null,null,null,null,null,null,null,null,null,null,null,null,"","","","",0,0,null,"",""]
[{"$f":"Berechnung!AX33","v":0},null,{"$f":"Berechnung!BH33","v":""},{"$f":"Berechnung!BF33","v":""},null,null,"",{"$f":"Berechnung!Z33","v":""},"",{"$f":"Berechnung!AA33","v":""},null,null,null,null,null,null,null,null,null,null,null,null,null,null,null,"","","","",0,0,null,"",""]
[{"$f":"Berechnung!AX34","v":0},null,{"$f":"Berechnung!BH34","v":""},{"$f":"Berechnung!BF34","v":""},null,null,"",{"$f":"Berechnung!Z34","v":""},"",{"$f":"Berechnung!AA34","v":""},null,null,null,null,null,null,null,null,null,null,null,null,null,null,null,{"$f":"IF(E34=\"\",\"\",IF(AND(E34>\"\",O34+P34>1),3,IF(O34+P34>=2,3,IF($Y$1>AA34,1,0))))","v":""},{"$f":"IF(E34=\"\",\"\",E34+$AA$1)","v":""},{"$f":"IFERROR(LARGE(K34:N34,1),\"\")","v":""},{"$f":"H34","v":""},{"$f":"IF(K34>0,1)+IF(L34>0,1)+IF(M34>0,1)+IF(N34>0,1)","v":0},0,null,{"$f":"IFERROR(LARGE(Q34:T34,1),\"\")","v":""},{"$f":"J34","v":""}]
[{"$f":"Berechnung!AX35","v":0},null,{"$f":"Berechnung!BH35","v":""},{"$f":"Berechnung!BF35","v":""},null,null,"",{"$f":"Berechnung!Z35","v":""},"",{"$f":"Berechnung!AA35","v":""},null,null,null,null,null,null,null,null,null,null,null,null,null,null,null,"","","","",0,0,null,"",""]
[{"$f":"Berechnung!AX36","v":0},null,{"$f":"Berechnung!BH36","v":""},{"$f":"Berechnung!BF36","v":""},null,null,"",{"$f":"Berechnung!Z36","v":""},"",{"$f":"Berechnung!AA36","v":""},null,null,null,null,null,null,null,null,null,null,null,null,null,null,null,"","","","",0,0,null,"",""]
[{"$f":"Berechnung!AX37","v":0},null,{"$f":"Berechnung!BH37","v":""},{"$f":"Berechnung!BF37","v":""},null,null,"",{"$f":"Berechnung!Z37","v":""},"",{"$f":"Berechnung!AA37","v":""},null,null,null,null,null,null,null,null,null,null,null,null,null,null,null,"","","","",0,0,null,"",""]
[{"$f":"Berechnung!AX38","v":0},null,{"$f":"Berechnung!BH38","v":""},{"$f":"Berechnung!BF38","v":""},null,null,"",{"$f":"Berechnung!Z38","v":""},"",{"$f":"Berechnung!AA38","v":""},null,null,null,null,null,null,null,null,null,null,null,null,null,null,null,"","","","",0,0,null,"",""]
[{"$f":"Berechnung!AX39","v":0},null,{"$f":"Berechnung!BH39","v":""},{"$f":"Berechnung!BF39","v":""},null,null,"",{"$f":"Berechnung!Z39","v":""},"",{"$f":"Berechnung!AA39","v":""},null,null,null,null,null,null,null,null,null,null,null,null,null,null,null,"","","","",0,0,null,"",""]
[{"$f":"Berechnung!AX40","v":0},null,{"$f":"Berechnung!BH40","v":""},{"$f":"Berechnung!BF40","v":""},null,null,"",{"$f":"Berechnung!Z40","v":""},"",{"$f":"Berechnung!AA40","v":""},null,null,null,null,null,null,null,null,null,null,null,null,null,null,null,"","","","",0,0,null,"",""]
[{"$f":"Berechnung!AX41","v":0},null,{"$f":"Berechnung!BH41","v":""},{"$f":"Berechnung!BF41","v":""},null,null,"",{"$f":"Berechnung!Z41","v":""},"",{"$f":"Berechnung!AA41","v":""},null,null,null,null,null,null,null,null,null,null,null,null,null,null,null,"","","","",0,0,null,"",""]
[{"$f":"Berechnung!AX42","v":0},null,{"$f":"Berechnung!BH42","v":""},{"$f":"Berechnung!BF42","v":""},null,null,"",{"$f":"Berechnung!Z42","v":""},"",{"$f":"Berechnung!AA42","v":""},null,null,null,null,null,null,null,null,null,null,null,null,null,null,null,"","","","",0,0,null,"",""]
[{"$f":"Berechnung!AX43","v":0},null,{"$f":"Berechnung!BH43","v":""},{"$f":"Berechnung!BF43","v":""},null,null,"",{"$f":"Berechnung!Z43","v":""},"",{"$f":"Berechnung!AA43","v":""},null,null,null,null,null,null,null,null,null,null,null,null,null,null,null,"","","","",0,0,null,"",""]
[{"$f":"Berechnung!AX44","v":0},null,{"$f":"Berechnung!BH44","v":""},{"$f":"Berechnung!BF44","v":""},null,null,"",{"$f":"Berechnung!Z44","v":""},"",{"$f":"Berechnung!AA44","v":""},null,null,null,null,null,null,null,null,null,null,null,null,null,null,null,"","","","",0,0,null,"",""]
[{"$f":"Berechnung!AX45","v":0},null,{"$f":"Berechnung!BH45","v":""},{"$f":"Berechnung!BF45","v":""},null,null,"",{"$f":"Berechnung!Z45","v":""},"",{"$f":"Berechnung!AA45","v":""},null,null,null,null,null,null,null,null,null,null,null,null,null,null,null,"","","","",0,0,null,"",""]
[{"$f":"Berechnung!AX46","v":0},null,{"$f":"Berechnung!BH46","v":""},{"$f":"Berechnung!BF46","v":""},null,null,"",{"$f":"Berechnung!Z46","v":""},"",{"$f":"Berechnung!AA46","v":""},null,null,null,null,null,null,null,null,null,null,null,null,null,null,null,"","","","",0,0,null,"",""]
[{"$f":"Berechnung!AX47","v":0},null,{"$f":"Berechnung!BH47","v":""},{"$f":"Berechnung!BF47","v":""},null,null,"",{"$f":"Berechnung!Z47","v":""},"",{"$f":"Berechnung!AA47","v":""},null,null,null,null,null,null,null,null,null,null,null,null,null,null,null,"","","","",0,0,null,"",""]
[{"$f":"Berechnung!AX48","v":0},null,{"$f":"Berechnung!BH48","v":""},{"$f":"Berechnung!BF48","v":""},null,null,"",{"$f":"Berechnung!Z48","v":""},"",{"$f":"Berechnung!AA48","v":""},null,null,null,null,null,null,null,null,null,null,null,null,null,null,null,"","","","",0,0,null,"",""]
[{"$f":"Berechnung!AX49","v":0},null,{"$f":"Berechnung!BH49","v":""},{"$f":"Berechnung!BF49","v":""},null,null,"",{"$f":"Berechnung!Z49","v":""},"",{"$f":"Berechnung!AA49","v":""},null,null,null,null,null,null,null,null,null,null,null,null,null,null,null,"","","","",0,0,null,"",""]
[{"$f":"Berechnung!AX50","v":0},null,{"$f":"Berechnung!BH50","v":""},{"$f":"Berechnung!BF50","v":""},null,null,"",{"$f":"Berechnung!Z50","v":""},"",{"$f":"Berechnung!AA50","v":""},null,null,null,null,null,null,null,null,null,null,null,null,null,null,null,"","","","",0,0,null,"",""]
[{"$f":"Berechnung!AX51","v":0},null,{"$f":"Berechnung!BH51","v":""},{"$f":"Berechnung!BF51","v":""},null,null,"",{"$f":"Berechnung!Z51","v":""},"",{"$f":"Berechnung!AA51","v":""},null,null,null,null,null,null,null,null,null,null,null,null,null,null,null,"","","","",0,0,null,"",""]
[{"$f":"Berechnung!AX52","v":0},null,{"$f":"Berechnung!BH52","v":""},{"$f":"Berechnung!BF52","v":""},null,null,"",{"$f":"Berechnung!Z52","v":""},"",{"$f":"Berechnung!AA52","v":""},null,null,null,null,null,null,null,null,null,null,null,null,null,null,null,"","","","",0,0,null,"",""]
[{"$f":"Berechnung!AX53","v":0},null,{"$f":"Berechnung!BH53","v":""},{"$f":"Berechnung!BF53","v":""},null,null,"",{"$f":"Berechnung!Z53","v":""},"",{"$f":"Berechnung!AA53","v":""},null,null,null,null,null,null,null,null,null,null,null,null,null,null,null,"","","","",0,0,null,"",""]
[{"$f":"Berechnung!AX54","v":0},null,{"$f":"Berechnung!BH54","v":""},{"$f":"Berechnung!BF54","v":""},null,null,"",{"$f":"Berechnung!Z54","v":""},"",{"$f":"Berechnung!AA54","v":""},null,null,null,null,null,null,null,null,null,null,null,null,null,null,null,"","","","",0,0,null,"",""]
[{"$f":"Berechnung!AX55","v":0},null,{"$f":"Berechnung!BH55","v":""},{"$f":"Berechnung!BF55","v":""},null,null,"",{"$f":"Berechnung!Z55","v":""},"",{"$f":"Berechnung!AA55","v":""},null,null,null,null,null,null,null,null,null,null,null,null,null,null,null,"","","","",0,0,null,"",""]
[{"$f":"Berechnung!AX56","v":0},null,{"$f":"Berechnung!BH56","v":""},{"$f":"Berechnung!BF56","v":""},null,null,"",{"$f":"Berechnung!Z56","v":""},"",{"$f":"Berechnung!AA56","v":""},null,null,null,null,null,null,null,null,null,null,null,null,null,null,null,"","","","",0,0,null,"",""]
[{"$f":"Berechnung!AX57","v":0},null,{"$f":"Berechnung!BH57","v":""},{"$f":"Berechnung!BF57","v":""},null,null,"",{"$f":"Berechnung!Z57","v":""},"",{"$f":"Berechnung!AA57","v":""},null,null,null,null,null,null,null,null,null,null,null,null,null,null,null,"","","","",0,0,null,"",""]
[{"$f":"Berechnung!AX58","v":0},null,{"$f":"Berechnung!BH58","v":""},{"$f":"Berechnung!BF58","v":""},null,null,"",{"$f":"Berechnung!Z58","v":""},"",{"$f":"Berechnung!AA58","v":""},null,null,null,null,null,null,null,null,null,null,null,null,null,null,null,"","","","",0,0,null,"",""]
[{"$f":"Berechnung!AX59","v":0},null,{"$f":"Berechnung!BH59","v":""},{"$f":"Berechnung!BF59","v":""},null,null,"",{"$f":"Berechnung!Z59","v":""},"",{"$f":"Berechnung!AA59","v":""},null,null,null,null,null,null,null,null,null,null,null,null,null,null,null,"","","","",0,0,null,"",""]
[{"$f":"Berechnung!AX60","v":0},null,{"$f":"Berechnung!BH60","v":""},{"$f":"Berechnung!BF60","v":""},null,null,"",{"$f":"Berechnung!Z60","v":""},"",{"$f":"Berechnung!AA60","v":""},null,null,null,null,null,null,null,null,null,null,null,null,null,null,null,"","","","",0,0,null,"",""]
[{"$f":"Berechnung!AX61","v":0},null,{"$f":"Berechnung!BH61","v":""},{"$f":"Berechnung!BF61","v":""},null,null,"",{"$f":"Berechnung!Z61","v":""},"",{"$f":"Berechnung!AA61","v":""},null,null,null,null,null,null,null,null,null,null,null,null,null,null,null,"","","","",0,0,null,"",""]
[{"$f":"Berechnung!AX62","v":0},null,{"$f":"Berechnung!BH62","v":""},{"$f":"Berechnung!BF62","v":""},null,null,"",{"$f":"Berechnung!Z62","v":""},"",{"$f":"Berechnung!AA62","v":""},null,null,null,null,null,null,null,null,null,null,null,null,null,null,null,"","","","",0,0,null,"",""]
[{"$f":"Berechnung!AX63","v":0},null,{"$f":"Berechnung!BH63","v":""},{"$f":"Berechnung!BF63","v":""},null,null,"",{"$f":"Berechnung!Z63","v":""},"",{"$f":"Berechnung!AA63","v":""},null,null,null,null,null,null,null,null,null,null,null,null,null,null,null,"","","","",0,0,null,"",""]
[{"$f":"Berechnung!AX64","v":0},null,{"$f":"Berechnung!BH64","v":""},{"$f":"Berechnung!BF64","v":""},null,null,"",{"$f":"Berechnung!Z64","v":""},"",{"$f":"Berechnung!AA64","v":""},null,null,null,null,null,null,null,null,null,null,null,null,null,null,null,"","","","",0,0,null,"",""]
[{"$f":"Berechnung!AX65","v":0},null,{"$f":"Berechnung!BH65","v":""},{"$f":"Berechnung!BF65","v":""},null,null,"",{"$f":"Berechnung!Z65","v":""},"",{"$f":"Berechnung!AA65","v":""},null,null,null,null,null,null,null,null,null,null,null,null,null,null,null,"","","","",0,0,null,"",""]
[{"$f":"Berechnung!AX66","v":0},null,{"$f":"Berechnung!BH66","v":""},{"$f":"Berechnung!BF66","v":""},null,null,"",{"$f":"Berechnung!Z66","v":""},"",{"$f":"Berechnung!AA66","v":""},null,null,null,null,null,null,null,null,null,null,null,null,null,null,null,{"$f":"IF(E66=\"\",\"\",IF(AND(E66>\"\",O66+P66>1),3,IF(O66+P66>=2,3,IF($Y$1>AA66,1,0))))","v":""},{"$f":"IF(E66=\"\",\"\",E66+$AA$1)","v":""},{"$f":"IFERROR(LARGE(K66:N66,1),\"\")","v":""},{"$f":"H66","v":""},{"$f":"IF(K66>0,1)+IF(L66>0,1)+IF(M66>0,1)+IF(N66>0,1)","v":0},0,null,{"$f":"IFERROR(LARGE(Q66:T66,1),\"\")","v":""},{"$f":"J66","v":""}]
[{"$f":"Berechnung!AX67","v":0},null,{"$f":"Berechnung!BH67","v":""},{"$f":"Berechnung!BF67","v":""},null,null,{"$f":"IF(F67=\"\",\"\",F67-E67)","v":""},{"$f":"Berechnung!Z67","v":""},{"$f":"IF(H67>\"\",\"v\",\"\")","v":""},{"$f":"Berechnung!AA67","v":""},null,null,null,null,null,null,null,null,null,null,null,null,null,null,null,"","","","",0,{"$f":"IF(Q67>0,1)+IF(R67>0,1)+IF(S67>0,1)+IF(T67>0,1)","v":0},null,"",""]
[{"$f":"Berechnung!AX68","v":0},null,{"$f":"Berechnung!BH68","v":""},{"$f":"Berechnung!BF68","v":""},null,null,"",{"$f":"Berechnung!Z68","v":""},"",{"$f":"Berechnung!AA68","v":""},null,null,null,null,null,null,null,null,null,null,null,null,null,null,null,"","","","",0,0,null,"",""]
[{"$f":"Berechnung!AX69","v":0},null,{"$f":"Berechnung!BH69","v":""},{"$f":"Berechnung!BF69","v":""},null,null,"",{"$f":"Berechnung!Z69","v":""},"",{"$f":"Berechnung!AA69","v":""},null,null,null,null,null,null,null,null,null,null,null,null,null,null,null,"","","","",0,0,null,"",""]
[{"$f":"Berechnung!AX70","v":0},null,{"$f":"Berechnung!BH70","v":""},{"$f":"Berechnung!BF70","v":""},null,null,"",{"$f":"Berechnung!Z70","v":""},"",{"$f":"Berechnung!AA70","v":""},null,null,null,null,null,null,null,null,null,null,null,null,null,null,null,"","","","",0,0,null,"",""]
[{"$f":"Berechnung!AX71","v":0},null,{"$f":"Berechnung!BH71","v":""},{"$f":"Berechnung!BF71","v":""},null,null,"",{"$f":"Berechnung!Z71","v":""},"",{"$f":"Berechnung!AA71","v":""},null,null,null,null,null,null,null,null,null,null,null,null,null,null,null,"","","","",0,0,null,"",""]
[{"$f":"Berechnung!AX72","v":0},null,{"$f":"Berechnung!BH72","v":""},{"$f":"Berechnung!BF72","v":""},null,null,"",{"$f":"Berechnung!Z72","v":""},"",{"$f":"Berechnung!AA72","v":""},null,null,null,null,null,null,null,null,null,null,null,null,null,null,null,"","","","",0,0,null,"",""]
[{"$f":"Berechnung!AX73","v":0},null,{"$f":"Berechnung!BH73","v":""},{"$f":"Berechnung!BF73","v":""},null,null,"",{"$f":"Berechnung!Z73","v":""},{"$f":"IF(H73>\"\",\"v\",\"\")","v":""},{"$f":"Berechnung!AA73","v":""},null,null,null,null,null,null,null,null,null,null,null,null,null,null,null,"","","","",0,0,null,"",""]
[{"$f":"Berechnung!AX74","v":0},null,{"$f":"Berechnung!BH74","v":""},{"$f":"Berechnung!BF74","v":""},null,null,"",{"$f":"Berechnung!Z74","v":""},"",{"$f":"Berechnung!AA74","v":""},null,null,null,null,null,null,null,null,null,null,null,null,null,null,null,"","","","",0,0,null,"",""]
[{"$f":"Berechnung!AX75","v":0},null,{"$f":"Berechnung!BH75","v":""},{"$f":"Berechnung!BF75","v":""},null,null,"",{"$f":"Berechnung!Z75","v":""},"",{"$f":"Berechnung!AA75","v":""},null,null,null,null,null,null,null,null,null,null,null,null,null,null,null,"","","","",0,0,null,"",""]
[{"$f":"Berechnung!AX76","v":0},null,{"$f":"Berechnung!BH76","v":""},{"$f":"Berechnung!BF76","v":""},null,null,"",{"$f":"Berechnung!Z76","v":""},"",{"$f":"Berechnung!AA76","v":""},null,null,null,null,null,null,null,null,null,null,null,null,null,null,null,"","","","",0,0,null,"",""]
[{"$f":"Berechnung!AX77","v":0},null,{"$f":"Berechnung!BH77","v":""},{"$f":"Berechnung!BF77","v":""},null,null,"",{"$f":"Berechnung!Z77","v":""},"",{"$f":"Berechnung!AA77","v":""},null,null,null,null,null,null,null,null,null,null,null,null,null,null,null,"","","","",0,0,null,"",""]
[{"$f":"Berechnung!AX78","v":0},null,{"$f":"Berechnung!BH78","v":""},{"$f":"Berechnung!BF78","v":""},null,null,"",{"$f":"Berechnung!Z78","v":""},"",{"$f":"Berechnung!AA78","v":""},null,null,null,null,null,null,null,null,null,null,null,null,null,null,null,"","","","",0,0,null,"",""]
[{"$f":"Berechnung!AX79","v":0},null,{"$f":"Berechnung!BH79","v":""},{"$f":"Berechnung!BF79","v":""},null,null,"",{"$f":"Berechnung!Z79","v":""},"",{"$f":"Berechnung!AA79","v":""},null,null,null,null,null,null,null,null,null,null,null,null,null,null,null,"","","","",0,0,null,"",""]
[{"$f":"Berechnung!AX80","v":0},null,{"$f":"Berechnung!BH80","v":""},{"$f":"Berechnung!BF80","v":""},null,null,"",{"$f":"Berechnung!Z80","v":""},"",{"$f":"Berechnung!AA80","v":""},null,null,null,null,null,null,null,null,null,null,null,null,null,null,null,"","","","",0,0,null,"",""]
[{"$f":"Berechnung!AX81","v":0},null,{"$f":"Berechnung!BH81","v":""},{"$f":"Berechnung!BF81","v":""},null,null,"",{"$f":"Berechnung!Z81","v":""},"",{"$f":"Berechnung!AA81","v":""},null,null,null,null,null,null,null,null,null,null,null,null,null,null,null,"","","","",0,0,null,"",""]
[null,null,null,null,null,null,null,null,null,null,null,null,null,null,null,null,null,null,null,null,null,null,null,null,null,null,null,{"$f":"IFERROR(LARGE(AB2:AB81,1),0)","v":0},null,{"$f":"SUM(AD2:AD81)","v":0},{"$f":"SUM(AE2:AE81)","v":0},null,{"$f":"IFERROR(LARGE(AG2:AG81,1),0)","v":0}]
[null,null,null,null,null,null,null,null,null,null,null,null,null,null,{"$f":"SUM(O2:P81)","v":0},null,null,null,null,null,null,null,null,null,null,null,null,{"$f":"IF(AB82=\"\",\"\",VLOOKUP(AB82,AB2:$AC$81,2,FALSE))","v":{"$error":"#N/A"}},null,null,null,null,{"$f":"IFERROR(IF(AG82=\"\",\"\",VLOOKUP(AG82,$AG$2:$AH$81,2,FALSE)),\"\")","v":""}]
[null,null,null,null,null,null,null,null,null,null,null,null,null,null,null,null,null,null,null,null,null,null,null,null,null,null,null,{"$f":"IF(AB82>AG82,AB83,AG83)","v":""}]
[null,null,null,null,null,null,null,null,null,null,null,null,null,null,null,null,null,null,null,null,null,null,null,null,null,null,null,{"$f":"IF(AND(AB82=0,AG82=0),\"\",IF(AB82>AG82,AB82,AG82))","v":""}]
[]
[]
[]
[]
[]
[]
[]
[]
[]
[]
[]
[]
[]
[]
[]
[]
[]
[]
[]
[]
[]
[]
[]
[]
[]
[]
[null,null,null,null,{"$f":"COUNTA(E2:E99)","v":0}]

{"sheet":"Berechnung","index":4,"n_rows":209,"n_cols":118,"rows_kept":209,"cut":false,"hidden":true,"merged":[[167,18,167,19],[167,20,167,21],[167,4,167,5],[167,6,167,7],[167,8,167,9],[167,13,167,14],[167,16,167,17],[114,31,114,34],[0,109,0,110],[0,111,0,112],[0,0,5,0],[77,0,82,0],[66,0,71,0],[11,0,16,0],[22,0,27,0],[33,0,38,0],[44,0,49,0],[55,0,60,0]]}
["A",null,null,"Spieler","M","W","L","F+","F-","U",null,null,"Rang","Rang","P+",null,null,null,null,null,null,null,null,null,null,null,null,null,null,null,null,"F","F","W","L","M","U",null,null,null,null,null,null,null,null,null,null,null,null,null,null,null,null,null,null,null,null,null,null,{"$f":"Spieler!S12","v":0},{"$f":"AW1","v":0},8,9,10,11,12,13,14,15,16,17,18,19,20,21,22,23,24,25,26,27,28,29,30,31,32,33,34,35,36,37,38,39,40,{"$f":"BH1","v":0},null,null,{"$f":"Spieler!I1","v":0},null,null,null,null,null,null,null,null,null,null,null,"Gesetzte Spieler",null,"nicht gesetzte Sp"]
[null,1,"A1",{"$f":"'1. Runde Gruppen'!D3","v":""},{"$f":"AJ2+AJ5+AJ8+AJ4","v":0},{"$f":"AH2+AH5+AH8+AH4","v":0},{"$f":"AI2+AI5+AI8+AI4","v":0},{"$f":"AF2+AF5+AF8+AF4","v":0},{"$f":"AG2+AG5+AG8+AG4","v":0},{"$f":"AK2+AK5+AK8+AK4","v":0},null,null,{"$f":"IF(D2=\"X\",-200000,IF(D2=\"Y\",-200000,IF(D2=\"Z\",-200000,IF(D2=\"\",-200000,IF(D2=\"Z Freilos\",-200000,IF(D2=\"\",(-90000),(F2*10000)+(H2*1000)+(J2*10)+E2-(G2*10000)-(I2*1000)+O2))))))","v":-200000},{"$f":"IF(E2=0,\"\",RANK(M2,M2:M6))","v":""},{"$f":"'1. Runde Gruppen'!O3","v":0},{"$f":"IF(D2=\"\",\"\",D2)","v":""},{"$f":"IF(V2=\"\",\"\",1)","v":""},1,{"$f":"IF(Q2=\"\",\"\",R2)","v":""},"A",{"$f":"C2","v":"A1"},{"$f":"D2","v":""},{"$f":"C3","v":"A2"},{"$f":"D3","v":""},{"$f":"IFERROR(SMALL($S$2:$S$88,ROW()-1),\"\")","v":""},{"$f":"IFERROR(IF(Y2=\"\",\"\",VLOOKUP(Y2,$S$1:$V$88,4,FALSE)),\"\")","v":""},{"$f":"IFERROR(IF(Y2=\"\",\"\",VLOOKUP(Y2,$S$1:$X$88,6,FALSE)),\"\")","v":""},{"$f":"Matches!O2","v":0},{"$f":"Matches!P2","v":0},null,null,{"$f":"IFERROR(VLOOKUP(S2,$Y$2:$AC$88,4,FALSE),\"\")","v":0},{"$f":"IFERROR(VLOOKUP(S2,$Y$2:$AC$88,5,FALSE),\"\")","v":0},{"$f":"IF(AF2>AG2,1,0)","v":0},{"$f":"IF(AG2>AF2,1,0)","v":0},{"$f":"IF(AF2+AG2>=1,1,0)","v":0},{"$f":"IF(AND(AF2+AG2>1,AF2=AG2),1,0)","v":0},null,null,null,null,null,null,null,null,null,null,null,null,null,null,null,null,null,null,null,null,{"$f":"IF(Y2=\"\",\"\",VLOOKUP(Y2,$S$2:$T$88,2,FALSE))","v":""},null,{"$f":"IF(Y2=\"\",\"\",IF(Y2>0,ROW()-1))","v":""},{"$f":"IF($CS$1=\"X\",\"\",\"A1\")","v":"A1"},{"$f":"$BI$2","v":"A1"},{"$f":"$BI$2","v":"A1"},"A1","A1","A1","A1","A1","A1","A1","A1","A1","A1","A1","A1","A1","A1","A1","A1","A1","A1","A1","A1","A1","A1","A1","A1","A1","A1","A1","A1","A1","A1","A1",{"$f":"IFERROR(LOOKUP($CQ$1,$BI$1:$CP$1,BI2:CP2),\"\")","v":"A1"},{"$f":"CS44","v":"A1"},{"$f":"IF(CT1>0,Spieler!P2,\"\")","v":""},{"$f":"Spieler!Q2","v":""},{"$f":"IF($CQ$1<8,\"\",IF(CS2=CR2,\"\",CR2))","v":""},{"$f":"IF(ROW(CU1)>COUNTA(CU:CU),\"\",INDEX(CU:CU,SMALL(IF(CU$2:CU$100<>\"\",ROW($2:$100)),ROW(CU1))))","v":"Achtelfinale"},{"$f":"IFERROR(IF(CV2>\"\",CV2,\"\"),\"\")","v":"Achtelfinale"},{"$f":"CS2","v":""},{"$f":"Spieler!C2","v":""},{"$f":"VLOOKUP(CY2,$DM$2:$DN$49,2,FALSE)","v":""},{"$f":"CT2","v":""},{"$f":"IF(ROW(CX1)>COUNTA(CX:CX),\"\",INDEX(CX:CX,SMALL(IF(CX$2:CX$100<>\"\",ROW($2:$100)),ROW(CX1))))","v":"Achtelfinale"},{"$f":"IFERROR(IF(DB2>\"\",DB2,\"\"),\"\")","v":"Achtelfinale"},{"$f":"VLOOKUP(DC2,Spieler!$I$2:$J$41,2,FALSE)","v":{"$error":"#N/A"}},null,{"$f":"IFERROR(IF(CT2=\"\",\"\",IF(CT2>\"\",RAND()*5000000)),\"\")","v":""},{"$f":"CS2","v":""},{"$f":"IF(CU2=\"\",\"\",RAND()*1000)","v":""},{"$f":"CU2","v":""},{"$f":"IFERROR(LARGE($DF$2:$DG$9,1),\"\")","v":""},{"$f":"IFERROR(VLOOKUP(DJ2,$DF$2:$DG$9,2,FALSE),\"\")","v":""},null,{"$f":"CT2","v":""},{"$f":"DK2","v":""}]
[null,2,"A2",{"$f":"'1. Runde Gruppen'!D4","v":""},{"$f":"AJ2+AJ7+AJ3+AJ11","v":0},{"$f":"AI2+AH3+AH7+AH11","v":0},{"$f":"AH2+AI7+AI3+AI11","v":0},{"$f":"AG2+AF11+AF7+AF3","v":0},{"$f":"AF2+AG3+AG7+AG11","v":0},{"$f":"AK2+AK7+AK3+AK11","v":0},null,null,{"$f":"IF(D3=\"X\",-200000,IF(D3=\"Y\",-200000,IF(D3=\"Z\",-200000,IF(D3=\"\",-200000,IF(D3=\"Z Freilos\",-200000,IF(D3=\"\",(-90000),(F3*10000)+(H3*1000)+(J3*10)+E3-(G3*10000)-(I3*1000)+O3))))))","v":-200000},{"$f":"IF(E3=0,\"\",RANK(M3,M2:M6))","v":""},{"$f":"'1. Runde Gruppen'!O4","v":0},{"$f":"IF(D3=\"\",\"\",D3)","v":""},{"$f":"IF(V3=\"\",\"\",2)","v":""},{"$f":"IF(B5=4,41,9)","v":9},{"$f":"IF(Q3=\"\",\"\",R3)","v":""},"A",{"$f":"C4","v":"A3"},{"$f":"IF(X3=\"\",\"\",D3)","v":""},{"$f":"C5","v":"A4"},{"$f":"D5","v":""},{"$f":"IFERROR(SMALL($S$2:$S$88,ROW()-1),\"\")","v":""},{"$f":"IFERROR(IF(Y3=\"\",\"\",VLOOKUP(Y3,$S$1:$V$88,4,FALSE)),\"\")","v":""},{"$f":"IFERROR(IF(Y3=\"\",\"\",VLOOKUP(Y3,$S$1:$X$88,6,FALSE)),\"\")","v":""},{"$f":"Matches!O3","v":0},{"$f":"Matches!P3","v":0},null,null,{"$f":"IFERROR(VLOOKUP(S3,$Y$2:$AC$88,4,FALSE),\"\")","v":0},{"$f":"IFERROR(VLOOKUP(S3,$Y$2:$AC$88,5,FALSE),\"\")","v":0},{"$f":"IF(AF3>AG3,1,0)","v":0},{"$f":"IF(AG3>AF3,1,0)","v":0},{"$f":"IF(AF3+AG3>=1,1,0)","v":0},{"$f":"IF(AND(AF3+AG3>1,AF3=AG3),1,0)","v":0},null,null,null,null,null,null,null,null,null,null,null,null,null,null,null,null,null,null,null,null,{"$f":"IF(Y3=\"\",\"\",VLOOKUP(Y3,$S$2:$T$88,2,FALSE))","v":""},null,{"$f":"IF(Y3=\"\",\"\",IF(Y3>0,ROW()-1))","v":""},"A2","A2","A2","A2","A2","A2","A2","A2","A2","A2","A2","A2","A2","A2","A2","A2","A2","A2","A2","A2","A2","A2","A2","A2","A2","A2","A2","A2","A2","A2","A2","A2","A2","A2",{"$f":"IFERROR(LOOKUP($CQ$1,$BI$1:$CP$1,BI3:CP3),\"\")","v":"A2"},{"$f":"CS45","v":"A2"},{"$f":"IF(CT1>0,Spieler!P3,\"\")","v":""},{"$f":"Spieler!Q3","v":""},{"$f":"IF($CQ$1<8,\"\",IF(CS3=CR3,\"\",CR3))","v":""},{"$f":"IF(ROW(CU2)>COUNTA(CU:CU),\"\",INDEX(CU:CU,SMALL(IF(CU$2:CU$100<>\"\",ROW($2:$100)),ROW(CU2))))","v":{"$error":"#NUM!"}},"",{"$f":"CS3","v":""},{"$f":"Spieler!C3","v":""},{"$f":"VLOOKUP(CY3,$DM$2:$DN$49,2,FALSE)","v":""},{"$f":"CT3","v":""},{"$f":"IF(ROW(CX2)>COUNTA(CX:CX),\"\",INDEX(CX:CX,SMALL(IF(CX$2:CX$100<>\"\",ROW($2:$100)),ROW(CX2))))","v":{"$error":"#NUM!"}},{"$f":"IFERROR(IF(DB3>\"\",DB3,\"\"),\"\")","v":""},{"$f":"VLOOKUP(DC3,Spieler!$I$2:$J$41,2,FALSE)","v":{"$error":"#N/A"}},null,{"$f":"IFERROR(IF(CT3=\"\",\"\",IF(CT3>\"\",RAND()*5000000)),\"\")","v":""},{"$f":"CS3","v":""},{"$f":"IF(CU3=\"\",\"\",RAND()*1000)","v":""},{"$f":"CU3","v":""},{"$f":"IFERROR(LARGE($DF$2:$DG$9,2),\"\")","v":""},{"$f":"IFERROR(VLOOKUP(DJ3,$DF$2:$DG$9,2,FALSE),\"\")","v":""},null,{"$f":"CT3","v":""},{"$f":"DK3","v":""}]
[null,3,"A3",{"$f":"'1. Runde Gruppen'!D5","v":""},{"$f":"AJ5+AJ7+AJ10+AJ9","v":0},{"$f":"AI5+AI7+AH10+AH9","v":0},{"$f":"AH5+AH7+AI10+AI9","v":0},{"$f":"AG5+AG7+AF10+AF9","v":0},{"$f":"AF5+AF7+AG10+AG9","v":0},{"$f":"AK5+AK7+AK10+AK9","v":0},null,null,{"$f":"IF(D4=\"X\",-200000,IF(D4=\"Y\",-200000,IF(D4=\"Z\",-200000,IF(D4=\"\",-200000,IF(D4=\"Z Freilos\",-200000,IF(D4=\"\",(-90000),(F4*10000)+(H4*1000)+(J4*10)+E4-(G4*10000)-(I4*1000)+O4))))))","v":-200000},{"$f":"IF(E4=0,\"\",RANK(M4,M2:M6))","v":""},{"$f":"'1. Runde Gruppen'!O5","v":0},{"$f":"IF(D4=\"\",\"\",D4)","v":""},{"$f":"IF(V4=\"\",\"\",3)","v":""},17,"","A",{"$f":"C2","v":"A1"},{"$f":"IF(X4=\"\",\"\",D2)","v":""},{"$f":"C6","v":"A5"},{"$f":"D6","v":""},{"$f":"IFERROR(SMALL($S$2:$S$88,ROW()-1),\"\")","v":""},"","",{"$f":"Matches!O4","v":0},{"$f":"Matches!P4","v":0},null,null,0,0,{"$f":"IF(AF4>AG4,1,0)","v":0},0,{"$f":"IF(AF4+AG4>=1,1,0)","v":0},0,null,null,null,null,null,null,null,null,null,null,null,null,null,null,null,null,null,null,null,null,"",null,"","A3","A3","A3","A3","A3","A3","A3","A3","A3","A3","A3","A3","A3","A3","A3","A3","A3","A3","A3","A3","A3","A3","A3","A3","A3","A3","A3","A3","A3","A3","A3","A3","A3","A3","A3","A3",{"$f":"IF(CT1>=3,Spieler!P4,\"\")","v":""},{"$f":"Spieler!Q4","v":""},"",{"$f":"IF(ROW(CU3)>COUNTA(CU:CU),\"\",INDEX(CU:CU,SMALL(IF(CU$2:CU$100<>\"\",ROW($2:$100)),ROW(CU3))))","v":{"$error":"#NUM!"}},"","",{"$f":"Spieler!C4","v":""},"","",{"$f":"IF(ROW(CX3)>COUNTA(CX:CX),\"\",INDEX(CX:CX,SMALL(IF(CX$2:CX$100<>\"\",ROW($2:$100)),ROW(CX3))))","v":{"$error":"#NUM!"}},"",{"$f":"VLOOKUP(DC4,Spieler!$I$2:$J$41,2,FALSE)","v":{"$error":"#N/A"}},null,"","","","",{"$f":"IFERROR(LARGE($DF$2:$DG$9,3),\"\")","v":""},{"$f":"IFERROR(VLOOKUP(DJ4,$DF$2:$DG$9,2,FALSE),\"\")","v":""},null,"",""]
[null,{"$f":"IF(D5=\"\",\"\",4)","v":""},"A4",{"$f":"'1. Runde Gruppen'!D6","v":""},{"$f":"AJ3+AJ6+AJ8+AJ10","v":0},{"$f":"AI3+AH6+AI8+AI10","v":0},{"$f":"AH3+AH8+AH10+AI6","v":0},{"$f":"AG3+AF6+AG8+AG10","v":0},{"$f":"AF3+AG6+AF8+AF10","v":0},{"$f":"AK3+AK8+AK10+AK6","v":0},null,null,{"$f":"IF(D5=\"X\",-200000,IF(D5=\"Y\",-200000,IF(D5=\"Z\",-200000,IF(D5=\"\",-200000,IF(D5=\"Z Freilos\",-200000,IF(D5=\"\",(-90000),(F5*10000)+(H5*1000)+(J5*10)+E5-(G5*10000)-(I5*1000)+O5))))))","v":-200000},{"$f":"IF(E5=0,\"\",RANK(M5,M2:M6))","v":""},{"$f":"'1. Runde Gruppen'!O6","v":0},{"$f":"IF(D5=\"\",\"\",D5)","v":""},{"$f":"IF(V5=\"\",\"\",4)","v":""},25,"","A",{"$f":"C3","v":"A2"},{"$f":"D2","v":""},{"$f":"C4","v":"A3"},{"$f":"D4","v":""},"","","",{"$f":"Matches!O5","v":0},{"$f":"Matches!P5","v":0},null,null,0,0,0,0,0,0,null,null,null,null,null,null,null,null,null,null,null,null,null,null,null,null,null,null,null,null,"",null,"","A4","A4","A4","A4","A4",{"$f":"$BI$7","v":"B1"},"A4","A4","A4","A4","A4",{"$f":"$BI$7","v":"B1"},"A4","A4","A4","A4","A4",{"$f":"$BI$7","v":"B1"},"A4","A4","A4","A4","A4","A4","A4","A4","A4","A4","A4","A4","A4","A4","A4","A4",{"$f":"IFERROR(LOOKUP($CQ$1,$BI$1:$CP$1,BI5:CP5),\"\")","v":"A4"},"A4",{"$f":"IF(CT1>=4,Spieler!P5,\"\")","v":""},{"$f":"Spieler!Q5","v":""},"",{"$f":"IF(ROW(CU4)>COUNTA(CU:CU),\"\",INDEX(CU:CU,SMALL(IF(CU$2:CU$100<>\"\",ROW($2:$100)),ROW(CU4))))","v":{"$error":"#NUM!"}},"","",{"$f":"Spieler!C5","v":""},"","",{"$f":"IF(ROW(CX4)>COUNTA(CX:CX),\"\",INDEX(CX:CX,SMALL(IF(CX$2:CX$100<>\"\",ROW($2:$100)),ROW(CX4))))","v":{"$error":"#NUM!"}},"",{"$f":"VLOOKUP(DC5,Spieler!$I$2:$J$41,2,FALSE)","v":{"$error":"#N/A"}},null,"","","","",{"$f":"IFERROR(LARGE($DF$2:$DG$9,4),\"\")","v":""},"",null,"",""]
[null,{"$f":"IF(D6=\"\",\"\",5)","v":""},"A5",{"$f":"'1. Runde Gruppen'!D7","v":""},{"$f":"AJ4+AJ6+AJ9+AJ11","v":0},{"$f":"AI4+AI6+AI9+AI11","v":0},{"$f":"AH4+AH6+AH9+AH11","v":0},{"$f":"AG4+AG6+AG9+AG11","v":0},{"$f":"AF4+AF6+AF9+AF11","v":0},{"$f":"AK4+AK6+AK9+AK11","v":0},null,null,{"$f":"IF(D6=\"X\",-200000,IF(D6=\"Y\",-200000,IF(D6=\"Z\",-200000,IF(D6=\"\",-200000,IF(D6=\"Z Freilos\",-200000,IF(D6=\"\",(-90000),(F6*10000)+(H6*1000)+(J6*10)+E6-(G6*10000)-(I6*1000)+O6))))))","v":-200000},{"$f":"IF(E6=0,\"\",RANK(M6,M2:M6))","v":""},{"$f":"'1. Runde Gruppen'!O7","v":0},{"$f":"IF(D6=\"\",\"\",D6)","v":""},{"$f":"IF(V6=\"\",\"\",5)","v":""},33,"","A",{"$f":"C5","v":"A4"},{"$f":"IF(X6=\"\",\"\",D5)","v":""},{"$f":"C6","v":"A5"},{"$f":"D6","v":""},"","","",{"$f":"Matches!O6","v":0},{"$f":"Matches!P6","v":0},null,null,0,0,{"$f":"IF(AF6>AG6,1,0)","v":0},0,0,0,null,null,null,null,null,null,null,null,null,null,null,null,null,null,null,null,null,null,null,null,"",null,"","A5",{"$f":"$BI$7","v":"B1"},"A5","A5",{"$f":"$BI$7","v":"B1"},"B2",{"$f":"$BI$7","v":"B1"},{"$f":"$BI$7","v":"B1"},{"$f":"$BI$7","v":"B1"},{"$f":"$BI$7","v":"B1"},{"$f":"$BI$7","v":"B1"},"B2",{"$f":"$BI$7","v":"B1"},{"$f":"$BI$7","v":"B1"},{"$f":"$BI$7","v":"B1"},{"$f":"$BI$7","v":"B1"},{"$f":"$BI$7","v":"B1"},"B2",{"$f":"$BI$7","v":"B1"},"B1","B1","B1","B1","B1","B1","B1","A5","A5","A5","A5","A5","A5","A5","A5","A5","A5",{"$f":"IF(CT1>=5,Spieler!P6,\"\")","v":""},{"$f":"Spieler!Q6","v":""},{"$f":"IF($CQ$1<8,\"\",IF(CS3=CR6,\"\",CR6))","v":""},{"$f":"IF(ROW(CU5)>COUNTA(CU:CU),\"\",INDEX(CU:CU,SMALL(IF(CU$2:CU$100<>\"\",ROW($2:$100)),ROW(CU5))))","v":{"$error":"#NUM!"}},"","",{"$f":"Spieler!C6","v":""},"","",{"$f":"IF(ROW(CX5)>COUNTA(CX:CX),\"\",INDEX(CX:CX,SMALL(IF(CX$2:CX$100<>\"\",ROW($2:$100)),ROW(CX5))))","v":{"$error":"#NUM!"}},"",{"$f":"VLOOKUP(DC6,Spieler!$I$2:$J$41,2,FALSE)","v":{"$error":"#N/A"}},null,"","","","",{"$f":"IFERROR(LARGE($DF$2:$DG$9,5),\"\")","v":""},"",null,"",""]
[null,null,null,null,null,null,null,null,null,null,null,null,null,null,null,null,{"$f":"IF(V7=\"\",\"\",6)","v":""},{"$f":"IF(B5=4,65,41)","v":41},"","A",{"$f":"C2","v":"A1"},{"$f":"D3","v":""},{"$f":"C4","v":"A3"},"","","","",{"$f":"Matches!O7","v":0},{"$f":"Matches!P7","v":0},null,null,0,0,0,{"$f":"IF(AG7>AF7,1,0)","v":0},0,0,null,null,null,null,null,null,null,null,null,null,null,null,null,null,null,null,null,null,null,null,"",null,"",{"$f":"IF($CS$1=\"X\",\"\",\"B1\")","v":"B1"},"B2",{"$f":"$BI$7","v":"B1"},"B1","B2","B3","B2","B2","B2","B2","B2","B3","B2","B2","B2","B2","B2","B3","B2","B2","B2","B2","B2","B2","B2","B2",{"$f":"$BI$7","v":"B1"},"B1","B1","B1","B1","B1","B1","B1","B1","B1",{"$f":"IF(CT1>=6,Spieler!P7,\"\")","v":""},{"$f":"Spieler!Q7","v":""},{"$f":"IF($CQ$1<8,\"\",IF(CS3=CR7,\"\",CR7))","v":""},{"$f":"IF(ROW(CU6)>COUNTA(CU:CU),\"\",INDEX(CU:CU,SMALL(IF(CU$2:CU$100<>\"\",ROW($2:$100)),ROW(CU6))))","v":{"$error":"#NUM!"}},"","",{"$f":"Spieler!C7","v":""},{"$f":"VLOOKUP(CY7,$DM$2:$DN$49,2,FALSE)","v":""},"",{"$f":"IF(ROW(CX6)>COUNTA(CX:CX),\"\",INDEX(CX:CX,SMALL(IF(CX$2:CX$100<>\"\",ROW($2:$100)),ROW(CX6))))","v":{"$error":"#NUM!"}},"",{"$f":"VLOOKUP(DC7,Spieler!$I$2:$J$41,2,FALSE)","v":{"$error":"#N/A"}},null,"","","","",{"$f":"IFERROR(LARGE($DF$2:$DG$9,6),\"\")","v":""},"",null,"",""]
[null,null,null,null,null,null,null,null,null,null,null,null,null,null,null,null,{"$f":"IF(V8=\"\",\"\",7)","v":""},49,"","A",{"$f":"C3","v":"A2"},{"$f":"IF(X8=\"\",\"\",D2)","v":""},"A4","","","","",{"$f":"Matches!O8","v":0},{"$f":"Matches!P8","v":0},null,null,0,0,0,0,0,0,null,null,null,null,null,null,null,null,null,null,null,null,null,null,null,null,null,null,null,null,"",null,"","B2","B3","B2","B2","B3",{"$f":"$BI$12","v":"C1"},"B3","B3","B3","B3","B3",{"$f":"$BI$12","v":"C1"},"B3","B3","B3","B3","B3",{"$f":"$BI$12","v":"C1"},"B3","B3","B3","B3","B3","B3","B3","B3","B2","B2","B2","B2","B2","B2","B2","B2","B2","B2",{"$f":"IF(CT1>=7,Spieler!P8,\"\")","v":""},{"$f":"Spieler!Q8","v":""},{"$f":"IF($CQ$1<8,\"\",IF(CS8=CR8,\"\",CR8))","v":""},{"$f":"IF(ROW(CU7)>COUNTA(CU:CU),\"\",INDEX(CU:CU,SMALL(IF(CU$2:CU$100<>\"\",ROW($2:$100)),ROW(CU7))))","v":{"$error":"#NUM!"}},"","",{"$f":"Spieler!C8","v":""},"","",{"$f":"IF(ROW(CX7)>COUNTA(CX:CX),\"\",INDEX(CX:CX,SMALL(IF(CX$2:CX$100<>\"\",ROW($2:$100)),ROW(CX7))))","v":{"$error":"#NUM!"}},"",{"$f":"VLOOKUP(DC8,Spieler!$I$2:$J$41,2,FALSE)","v":{"$error":"#N/A"}},null,"","","","",{"$f":"IFERROR(LARGE($DF$2:$DG$9,7),\"\")","v":""},"",null,"",""]
[null,null,null,null,null,null,null,null,null,null,null,null,null,null,null,null,{"$f":"IF(V9=\"\",\"\",8)","v":""},57,"","A",{"$f":"C4","v":"A3"},{"$f":"IF(X9=\"\",\"\",D4)","v":""},"A5","","","","",{"$f":"Matches!O9","v":0},{"$f":"Matches!P9","v":0},null,null,0,0,0,0,0,0,null,null,null,null,null,null,null,null,null,null,null,null,null,null,null,null,null,null,null,null,"",null,"","B3","B4","B3","B3","B4","C2",{"$f":"$BI$12","v":"C1"},"B4","B4","B4","B4","C2",{"$f":"$BI$12","v":"C1"},"B4","B4","B4","B4","C2",{"$f":"$BI$12","v":"C1"},"B4","B4","B4","B4","B4","B4","B4","B3","B3","B3","B3","B3","B3","B3","B3","B3","B3",{"$f":"IF(CT1=8,Spieler!P9,\"\")","v":""},{"$f":"Spieler!Q9","v":""},"",{"$f":"IF(ROW(CU8)>COUNTA(CU:CU),\"\",INDEX(CU:CU,SMALL(IF(CU$2:CU$100<>\"\",ROW($2:$100)),ROW(CU8))))","v":{"$error":"#NUM!"}},"","",{"$f":"Spieler!C9","v":""},"","",{"$f":"IF(ROW(CX8)>COUNTA(CX:CX),\"\",INDEX(CX:CX,SMALL(IF(CX$2:CX$100<>\"\",ROW($2:$100)),ROW(CX8))))","v":{"$error":"#NUM!"}},"",{"$f":"VLOOKUP(DC9,Spieler!$I$2:$J$41,2,FALSE)","v":{"$error":"#N/A"}},null,"","","","",{"$f":"IFERROR(LARGE($DF$2:$DG$9,8),\"\")","v":""},"",null,"",""]
[null,null,null,null,null,null,null,null,null,null,null,null,null,null,null,null,{"$f":"IF(V10=\"\",\"\",9)","v":""},{"$f":"IF(B5=4,9,65)","v":65},{"$f":"IF(Q10=\"\",\"\",R10)","v":""},"A",{"$f":"C2","v":"A1"},{"$f":"IF(X10=\"\",\"\",D4)","v":""},{"$f":"C5","v":"A4"},{"$f":"D5","v":""},"",{"$f":"IFERROR(IF(Y10=\"\",\"\",VLOOKUP(Y10,$S$1:$V$88,4,FALSE)),\"\")","v":""},{"$f":"IFERROR(IF(Y10=\"\",\"\",VLOOKUP(Y10,$S$1:$X$88,6,FALSE)),\"\")","v":""},{"$f":"Matches!O10","v":0},{"$f":"Matches!P10","v":0},null,null,0,0,0,0,0,0,null,null,null,null,null,null,null,null,null,null,null,null,null,null,null,null,null,null,null,null,"",null,"","B4",null,"B4","B4",{"$f":"$BI$12","v":"C1"},"C3","C2",{"$f":"$BI$12","v":"C1"},{"$f":"$BI$12","v":"C1"},{"$f":"$BI$12","v":"C1"},{"$f":"$BI$12","v":"C1"},"C3","C2",{"$f":"$BI$12","v":"C1"},{"$f":"$BI$12","v":"C1"},{"$f":"$BI$12","v":"C1"},{"$f":"$BI$12","v":"C1"},"C3","C2",{"$f":"$BI$12","v":"C1"},"C1","C1","C1","C1","C1","C1","B4","B4","B4","B4","B4","B4","B4","B4","B4","B4",null,null,"",{"$f":"IF(ROW(CU9)>COUNTA(CU:CU),\"\",INDEX(CU:CU,SMALL(IF(CU$2:CU$100<>\"\",ROW($2:$100)),ROW(CU9))))","v":{"$error":"#NUM!"}},"",{"$f":"CW2","v":"Achtelfinale"},{"$f":"Spieler!C10","v":""},"",{"$f":"Spieler!N10","v":""},{"$f":"IF(ROW(CX9)>COUNTA(CX:CX),\"\",INDEX(CX:CX,SMALL(IF(CX$2:CX$100<>\"\",ROW($2:$100)),ROW(CX9))))","v":{"$error":"#NUM!"}},"",{"$f":"VLOOKUP(DC10,Spieler!$I$2:$J$41,2,FALSE)","v":{"$error":"#N/A"}},null,null,null,"","",{"$f":"IFERROR(LARGE($DH$2:$DH$41,1),\"\")","v":""},{"$f":"IFERROR(VLOOKUP(DJ10,$DH$2:$DI$41,2,FALSE),\"\")","v":""},null,{"$f":"DA10","v":""},{"$f":"DK10","v":""}]
[null,null,null,null,null,null,null,null,null,null,null,null,null,null,null,null,{"$f":"IF(V11=\"\",\"\",10)","v":""},73,"","A",{"$f":"C3","v":"A2"},{"$f":"IF(X11=\"\",\"\",D3)","v":""},{"$f":"C6","v":"A5"},{"$f":"D6","v":""},"","","",{"$f":"Matches!O11","v":0},{"$f":"Matches!P11","v":0},null,null,0,0,0,0,0,0,null,null,null,null,null,null,null,null,null,null,null,null,null,null,null,null,null,null,null,null,"",null,"","B5",null,null,"B5","C2",{"$f":"$BI$17","v":"D1"},"C3","C2","C2","C2","C2",{"$f":"$BI$17","v":"D1"},"C3","C2","C2","C2","C2",{"$f":"$BI$17","v":"D1"},"C3","C2","C2","C2","C2","C2","C2","C2",{"$f":"$BI$12","v":"C1"},"B5","B5","B5","B5","B5","B5","B5","B5","B5",null,null,"",{"$f":"IF(ROW(CU10)>COUNTA(CU:CU),\"\",INDEX(CU:CU,SMALL(IF(CU$2:CU$100<>\"\",ROW($2:$100)),ROW(CU10))))","v":{"$error":"#NUM!"}},"",{"$f":"CW3","v":""},{"$f":"Spieler!C11","v":""},"",{"$f":"Spieler!N11","v":""},{"$f":"IF(ROW(CX10)>COUNTA(CX:CX),\"\",INDEX(CX:CX,SMALL(IF(CX$2:CX$100<>\"\",ROW($2:$100)),ROW(CX10))))","v":{"$error":"#NUM!"}},"",{"$f":"VLOOKUP(DC11,Spieler!$I$2:$J$41,2,FALSE)","v":{"$error":"#N/A"}},null,null,null,"","",{"$f":"IFERROR(LARGE($DH$2:$DH$41,2),\"\")","v":""},{"$f":"IFERROR(VLOOKUP(DJ11,$DH$2:$DI$41,2,FALSE),\"\")","v":""},null,{"$f":"DA11","v":""},""]
["B",null,null,"Spieler","M","W","L","F+","F-","U",null,null,"Rang","Rang","P+",null,null,null,"",null,null,null,null,null,"","","",{"$f":"Matches!O12","v":0},{"$f":"Matches!P12","v":0},null,null,null,null,null,null,null,null,null,null,null,null,null,null,null,null,null,null,null,null,null,null,null,null,null,null,null,null,"",null,"",{"$f":"IF($CS$1=\"X\",\"\",\"C1\")","v":"C1"},null,null,null,"C3","D2",{"$f":"$BI$17","v":"D1"},"C3","C3","C3","C3","D2",{"$f":"$BI$17","v":"D1"},"C3","C3","C3","C3","D2",{"$f":"$BI$17","v":"D1"},"C3","C3","C3","C3","C3","C3","C3","C2",{"$f":"$BI$12","v":"C1"},"C1","C1","C1","C1","C1","C1","C1","C1",null,null,{"$f":"IF($CQ$1<8,\"\",IF(CS4=CR12,\"\",CR12))","v":""},{"$f":"IF(ROW(CU11)>COUNTA(CU:CU),\"\",INDEX(CU:CU,SMALL(IF(CU$2:CU$100<>\"\",ROW($2:$100)),ROW(CU11))))","v":{"$error":"#NUM!"}},"","",{"$f":"Spieler!C12","v":""},"",{"$f":"Spieler!N12","v":""},{"$f":"IF(ROW(CX11)>COUNTA(CX:CX),\"\",INDEX(CX:CX,SMALL(IF(CX$2:CX$100<>\"\",ROW($2:$100)),ROW(CX11))))","v":{"$error":"#NUM!"}},"",{"$f":"VLOOKUP(DC12,Spieler!$I$2:$J$41,2,FALSE)","v":{"$error":"#N/A"}},null,null,null,"","",{"$f":"IFERROR(LARGE($DH$2:$DH$41,3),\"\")","v":""},"",null,"",""]
[null,1,"B1",{"$f":"'1. Runde Gruppen'!T3","v":""},{"$f":"AJ13+AJ16+AJ19+AJ15","v":0},{"$f":"AH13+AH16+AH19+AH15","v":0},{"$f":"AI13+AI16+AI19+AI15","v":0},{"$f":"AF13+AF16+AF19+AF15","v":0},{"$f":"AG13+AG16+AG19+AG15","v":0},{"$f":"AK13+AK16+AK19+AK15","v":0},null,null,{"$f":"IF(D13=\"X\",-200000,IF(D13=\"Y\",-200000,IF(D13=\"Z\",-200000,IF(D13=\"\",-200000,IF(D13=\"Z Freilos\",-200000,IF(D13=\"\",(-90000),(F13*10000)+(H13*1000)+(J13*10)+E13-(G13*10000)-(I13*1000)+O13))))))","v":-200000},{"$f":"IF(E13=0,\"\",RANK(M13,M13:M17))","v":""},{"$f":"'1. Runde Gruppen'!AE3","v":0},{"$f":"IF(D13=\"\",\"\",D13)","v":""},{"$f":"IF(V13=\"\",\"\",1)","v":""},2,"","B",{"$f":"C13","v":"B1"},{"$f":"D13","v":""},{"$f":"C14","v":"B2"},{"$f":"D14","v":""},"","","",{"$f":"Matches!O13","v":0},{"$f":"Matches!P13","v":0},null,null,{"$f":"IFERROR(VLOOKUP(S13,$Y$2:$AC$88,4,FALSE),\"\")","v":0},{"$f":"IFERROR(VLOOKUP(S13,$Y$2:$AC$88,5,FALSE),\"\")","v":0},{"$f":"IF(AF13>AG13,1,0)","v":0},{"$f":"IF(AG13>AF13,1,0)","v":0},{"$f":"IF(AF13+AG13>=1,1,0)","v":0},{"$f":"IF(AND(AF13+AG13>1,AF13=AG13),1,0)","v":0},null,null,null,null,null,null,null,null,null,null,null,null,null,null,null,null,null,null,null,null,"",null,"","C2",null,null,null,null,"D3","D2",{"$f":"$BI$17","v":"D1"},"C4","C4",{"$f":"$BI$17","v":"D1"},"D3","D2",{"$f":"$BI$17","v":"D1"},"C4","C4","C4","D3","D2",{"$f":"$BI$17","v":"D1"},"C4","C4","C4","C4","C4","C4","C3","C2","C2","C2","C2","C2","C2","C2","C2","C2",null,null,"",{"$f":"IF(ROW(CU12)>COUNTA(CU:CU),\"\",INDEX(CU:CU,SMALL(IF(CU$2:CU$100<>\"\",ROW($2:$100)),ROW(CU12))))","v":{"$error":"#NUM!"}},"","",{"$f":"Spieler!C13","v":""},"",{"$f":"Spieler!N13","v":""},{"$f":"IF(ROW(CX12)>COUNTA(CX:CX),\"\",INDEX(CX:CX,SMALL(IF(CX$2:CX$100<>\"\",ROW($2:$100)),ROW(CX12))))","v":{"$error":"#NUM!"}},"",{"$f":"VLOOKUP(DC13,Spieler!$I$2:$J$41,2,FALSE)","v":{"$error":"#N/A"}},null,null,null,"","",{"$f":"IFERROR(LARGE($DH$2:$DH$41,4),\"\")","v":""},"",null,{"$f":"DA13","v":""},""]
[null,2,"B2",{"$f":"'1. Runde Gruppen'!T4","v":""},{"$f":"AJ13+AJ18+AJ14+AJ22","v":0},{"$f":"AI13+AH14+AH18+AH22","v":0},{"$f":"AH13+AI18+AI14+AI22","v":0},{"$f":"AG13+AF22+AF18+AF14","v":0},{"$f":"AF13+AG14+AG18+AG22","v":0},{"$f":"AK13+AK18+AK14+AK22","v":0},null,null,{"$f":"IF(D14=\"X\",-200000,IF(D14=\"Y\",-200000,IF(D14=\"Z\",-200000,IF(D14=\"\",-200000,IF(D14=\"Z Freilos\",-200000,IF(D14=\"\",(-90000),(F14*10000)+(H14*1000)+(J14*10)+E14-(G14*10000)-(I14*1000)+O14))))))","v":-200000},{"$f":"IF(E14=0,\"\",RANK(M14,M13:M17))","v":""},{"$f":"'1. Runde Gruppen'!AE4","v":0},{"$f":"IF(D14=\"\",\"\",D14)","v":""},{"$f":"IF(V14=\"\",\"\",2)","v":""},{"$f":"IF(B16=4,42,10)","v":10},"","B",{"$f":"C15","v":"B3"},{"$f":"IF(X14=\"\",\"\",D14)","v":""},{"$f":"C16","v":"B4"},{"$f":"D16","v":""},"","","",{"$f":"Matches!O14","v":0},{"$f":"Matches!P14","v":0},null,null,{"$f":"IFERROR(VLOOKUP(S14,$Y$2:$AC$88,4,FALSE),\"\")","v":0},{"$f":"IFERROR(VLOOKUP(S14,$Y$2:$AC$88,5,FALSE),\"\")","v":0},0,0,{"$f":"IF(AF14+AG14>=1,1,0)","v":0},{"$f":"IF(AND(AF14+AG14>1,AF14=AG14),1,0)","v":0},null,null,null,null,null,null,null,null,null,null,null,null,null,null,null,null,null,null,null,null,"",null,"","C3",null,null,null,null,null,"D3","D2",{"$f":"$BI$17","v":"D1"},{"$f":"$BI$17","v":"D1"},"D2",{"$f":"$BI$22","v":"E1"},"D3","D2",{"$f":"$BI$17","v":"D1"},{"$f":"$BI$17","v":"D1"},{"$f":"BI17","v":"D1"},{"$f":"$BI$22","v":"E1"},"D3","D2",{"$f":"$BI$17","v":"D1"},"D1","D1","D1","D1","D1","C4","C3","C3","C3","C3","C3","C3","C3","C3","C3",null,null,"",{"$f":"IF(ROW(CU13)>COUNTA(CU:CU),\"\",INDEX(CU:CU,SMALL(IF(CU$2:CU$100<>\"\",ROW($2:$100)),ROW(CU13))))","v":{"$error":"#NUM!"}},"","",{"$f":"Spieler!C14","v":""},"",{"$f":"Spieler!N14","v":""},{"$f":"IF(ROW(CX13)>COUNTA(CX:CX),\"\",INDEX(CX:CX,SMALL(IF(CX$2:CX$100<>\"\",ROW($2:$100)),ROW(CX13))))","v":{"$error":"#NUM!"}},"",{"$f":"VLOOKUP(DC14,Spieler!$I$2:$J$41,2,FALSE)","v":{"$error":"#N/A"}},null,null,null,"","",{"$f":"IFERROR(LARGE($DH$2:$DH$41,5),\"\")","v":""},"",null,"",{"$f":"DK14","v":""}]
[null,3,"B3",{"$f":"'1. Runde Gruppen'!T5","v":""},{"$f":"AJ16+AJ18+AJ21+AJ20","v":0},{"$f":"AI16+AI18+AH21+AH20","v":0},{"$f":"AH16+AH18+AI21+AI20","v":0},{"$f":"AG16+AG18+AF21+AF20","v":0},{"$f":"AF16+AF18+AG21+AG20","v":0},{"$f":"AK16+AK18+AK21+AK20","v":0},null,null,{"$f":"IF(D15=\"X\",-200000,IF(D15=\"Y\",-200000,IF(D15=\"Z\",-200000,IF(D15=\"\",-200000,IF(D15=\"Z Freilos\",-200000,IF(D15=\"\",(-90000),(F15*10000)+(H15*1000)+(J15*10)+E15-(G15*10000)-(I15*1000)+O15))))))","v":-200000},{"$f":"IF(E15=0,\"\",RANK(M15,M13:M17))","v":""},{"$f":"'1. Runde Gruppen'!AE5","v":0},{"$f":"IF(D15=\"\",\"\",D15)","v":""},{"$f":"IF(V15=\"\",\"\",3)","v":""},18,"","B",{"$f":"C13","v":"B1"},{"$f":"IF(X15=\"\",\"\",D13)","v":""},{"$f":"C17","v":"B5"},{"$f":"D17","v":""},"","",{"$f":"IFERROR(IF(Y15=\"\",\"\",VLOOKUP(Y15,$S$1:$X$88,6,FALSE)),\"\")","v":""},{"$f":"Matches!O15","v":0},{"$f":"Matches!P15","v":0},null,null,0,0,0,0,{"$f":"IF(AF15+AG15>=1,1,0)","v":0},0,null,null,null,null,null,null,null,null,null,null,null,null,null,null,null,null,null,null,null,null,"",null,"","C4",null,null,null,null,null,null,"D3","D2","D2","D3","E2",{"$f":"$BI$22","v":"E1"},"D3","D2","D2",{"$f":"BI18","v":"D2"},"E2",{"$f":"$BI$22","v":"E1"},"D3","D2","D2","D2","D2","D2","D2",{"$f":"$BI$17","v":"D1"},"C4","C4","C4","C4","C4","C4","C4","C4","C4",null,null,"",{"$f":"IF(ROW(CU14)>COUNTA(CU:CU),\"\",INDEX(CU:CU,SMALL(IF(CU$2:CU$100<>\"\",ROW($2:$100)),ROW(CU14))))","v":{"$error":"#NUM!"}},"","",{"$f":"Spieler!C15","v":""},"",{"$f":"Spieler!N15","v":""},{"$f":"IF(ROW(CX14)>COUNTA(CX:CX),\"\",INDEX(CX:CX,SMALL(IF(CX$2:CX$100<>\"\",ROW($2:$100)),ROW(CX14))))","v":{"$error":"#NUM!"}},"",{"$f":"VLOOKUP(DC15,Spieler!$I$2:$J$41,2,FALSE)","v":{"$error":"#N/A"}},null,null,null,"","",{"$f":"IFERROR(LARGE($DH$2:$DH$41,6),\"\")","v":""},"",null,"",""]
[null,{"$f":"IF(D16=\"\",\"\",4)","v":""},"B4",{"$f":"'1. Runde Gruppen'!T6","v":""},{"$f":"AJ14+AJ17+AJ19+AJ21","v":0},{"$f":"AI14+AH17+AI19+AI21","v":0},{"$f":"AH14+AH19+AH21+AI17","v":0},{"$f":"AG14+AF17+AG19+AG21","v":0},{"$f":"AF14+AG17+AF19+AF21","v":0},{"$f":"AK14+AK19+AK21+AK17","v":0},null,null,{"$f":"IF(D16=\"X\",-200000,IF(D16=\"Y\",-200000,IF(D16=\"Z\",-200000,IF(D16=\"\",-200000,IF(D16=\"Z Freilos\",-200000,IF(D16=\"\",(-90000),(F16*10000)+(H16*1000)+(J16*10)+E16-(G16*10000)-(I16*1000)+O16))))))","v":-200000},{"$f":"IF(E16=0,\"\",RANK(M16,M13:M17))","v":""},{"$f":"'1. Runde Gruppen'!AE6","v":0},{"$f":"IF(D16=\"\",\"\",D16)","v":""},{"$f":"IF(V16=\"\",\"\",4)","v":""},26,"","B",{"$f":"C14","v":"B2"},{"$f":"D13","v":""},{"$f":"C15","v":"B3"},{"$f":"D15","v":""},"","","",{"$f":"Matches!O16","v":0},{"$f":"Matches!P16","v":0},null,null,0,0,0,0,0,0,null,null,null,null,null,null,null,null,null,null,null,null,null,null,null,null,null,null,null,null,"",null,"","C5",null,null,null,null,null,null,null,"D3","D3",{"$f":"$BI$22","v":"E1"},"E3","E2",{"$f":"$BI$22","v":"E1"},"D3","D3",{"$f":"BI19","v":"D3"},"E3","E2",{"$f":"$BI$22","v":"E1"},"D3","D3","D3","D3","D3","D3","D2",{"$f":"$BI$17","v":"D1"},"C5","C5","C5","C5","C5","C5","C5","C5",null,null,"",{"$f":"IF(ROW(CU15)>COUNTA(CU:CU),\"\",INDEX(CU:CU,SMALL(IF(CU$2:CU$100<>\"\",ROW($2:$100)),ROW(CU15))))","v":{"$error":"#NUM!"}},"","",{"$f":"Spieler!C16","v":""},"",{"$f":"Spieler!N16","v":""},{"$f":"IF(ROW(CX15)>COUNTA(CX:CX),\"\",INDEX(CX:CX,SMALL(IF(CX$2:CX$100<>\"\",ROW($2:$100)),ROW(CX15))))","v":{"$error":"#NUM!"}},"",{"$f":"VLOOKUP(DC16,Spieler!$I$2:$J$41,2,FALSE)","v":{"$error":"#N/A"}},null,null,null,"","",{"$f":"IFERROR(LARGE($DH$2:$DH$41,7),\"\")","v":""},"",null,"",""]
[null,{"$f":"IF(D17=\"\",\"\",5)","v":""},"B5",{"$f":"'1. Runde Gruppen'!T7","v":""},{"$f":"AJ15+AJ17+AJ20+AJ22","v":0},{"$f":"AI15+AI17+AI20+AI22","v":0},{"$f":"AH15+AH17+AH20+AH22","v":0},{"$f":"AG15+AG17+AG20+AG22","v":0},{"$f":"AF15+AF17+AF20+AF22","v":0},{"$f":"AK15+AK17+AK20+AK22","v":0},null,null,{"$f":"IF(D17=\"X\",-200000,IF(D17=\"Y\",-200000,IF(D17=\"Z\",-200000,IF(D17=\"\",-200000,IF(D17=\"Z Freilos\",-200000,IF(D17=\"\",(-90000),(F17*10000)+(H17*1000)+(J17*10)+E17-(G17*10000)-(I17*1000)+O17))))))","v":-200000},{"$f":"IF(E17=0,\"\",RANK(M17,M13:M17))","v":""},{"$f":"'1. Runde Gruppen'!AE7","v":0},{"$f":"IF(D17=\"\",\"\",D17)","v":""},{"$f":"IF(V17=\"\",\"\",5)","v":""},34,"","B",{"$f":"C16","v":"B4"},{"$f":"IF(X17=\"\",\"\",D16)","v":""},{"$f":"C17","v":"B5"},{"$f":"D17","v":""},"","","",{"$f":"Matches!O17","v":0},{"$f":"Matches!P17","v":0},null,null,0,0,0,0,0,0,null,null,null,null,null,null,null,null,null,null,null,null,null,null,null,null,null,null,null,null,"",null,"",{"$f":"IF($CS$1=\"X\",\"\",\"D1\")","v":"D1"},null,null,null,null,null,null,null,null,"D4","E2",{"$f":"$BI$27","v":"F1"},"E3","E2",{"$f":"$BI$22","v":"E1"},"D4",{"$f":"BI20","v":"D4"},{"$f":"$BI$27","v":"F1"},"E3","E2",{"$f":"$BI$22","v":"E1"},"D4","D4","D4","D4","D4","D3","D2",{"$f":"$BI$17","v":"D1"},"D1","D1","D1","D1","D1","D1","D1",null,null,{"$f":"IF($CQ$1<8,\"\",IF(CS5=CR17,\"\",CR17))","v":""},{"$f":"IF(ROW(CU16)>COUNTA(CU:CU),\"\",INDEX(CU:CU,SMALL(IF(CU$2:CU$100<>\"\",ROW($2:$100)),ROW(CU16))))","v":{"$error":"#NUM!"}},"","",{"$f":"Spieler!C17","v":""},"",{"$f":"Spieler!N17","v":""},{"$f":"IF(ROW(CX16)>COUNTA(CX:CX),\"\",INDEX(CX:CX,SMALL(IF(CX$2:CX$100<>\"\",ROW($2:$100)),ROW(CX16))))","v":{"$error":"#NUM!"}},"",{"$f":"VLOOKUP(DC17,Spieler!$I$2:$J$41,2,FALSE)","v":{"$error":"#N/A"}},null,null,null,"","",{"$f":"IFERROR(LARGE($DH$2:$DH$41,8),\"\")","v":""},"",null,"",""]
[null,null,null,null,null,null,null,null,null,null,null,null,null,null,null,null,{"$f":"IF(V18=\"\",\"\",6)","v":""},{"$f":"IF(B16=4,66,42)","v":42},"","B",{"$f":"C13","v":"B1"},{"$f":"D14","v":""},{"$f":"C15","v":"B3"},"","","","",{"$f":"Matches!O18","v":0},{"$f":"Matches!P18","v":0},null,null,0,0,0,0,0,0,null,null,null,null,null,null,null,null,null,null,null,null,null,null,null,null,null,null,null,null,"",null,"","D2",null,null,null,null,null,null,null,null,null,"E3","F2",{"$f":"$BI$27","v":"F1"},"E3","E2",{"$f":"$BI$22","v":"E1"},{"$f":"BI22","v":"E1"},"F2",{"$f":"$BI$27","v":"F1"},"E3","E2",{"$f":"$BI$22","v":"E1"},{"$f":"$BI$22","v":"E1"},{"$f":"$BI$22","v":"E1"},{"$f":"$BI$22","v":"E1"},{"$f":"$BI$22","v":"E1"},"D4","D3","D2","D2","D2","D2","D2","D2","D2","D2",null,null,"",{"$f":"IF(ROW(CU17)>COUNTA(CU:CU),\"\",INDEX(CU:CU,SMALL(IF(CU$2:CU$100<>\"\",ROW($2:$100)),ROW(CU17))))","v":{"$error":"#NUM!"}},"","",{"$f":"Spieler!C18","v":""},"",{"$f":"Spieler!N18","v":""},{"$f":"IF(ROW(CX17)>COUNTA(CX:CX),\"\",INDEX(CX:CX,SMALL(IF(CX$2:CX$100<>\"\",ROW($2:$100)),ROW(CX17))))","v":{"$error":"#NUM!"}},"",{"$f":"VLOOKUP(DC18,Spieler!$I$2:$J$41,2,FALSE)","v":{"$error":"#N/A"}},null,null,null,"","",{"$f":"IFERROR(LARGE($DH$2:$DH$41,9),\"\")","v":""},"",null,"",""]
[null,null,null,null,null,null,null,null,null,null,null,null,null,null,null,null,{"$f":"IF(V19=\"\",\"\",7)","v":""},50,"","B",{"$f":"C14","v":"B2"},{"$f":"IF(X19=\"\",\"\",D13)","v":""},"B4","","","","",{"$f":"Matches!O19","v":0},{"$f":"Matches!P19","v":0},null,null,0,0,0,0,0,0,null,null,null,null,null,null,null,null,null,null,null,null,null,null,null,null,null,null,null,null,"",null,"","D3",null,null,null,null,null,null,null,null,null,null,"F3","F2",{"$f":"$BI$27","v":"F1"},"E3","E2",{"$f":"BI23","v":"E2"},"F3","F2",{"$f":"$BI$27","v":"F1"},"E3","E2","E2","E2","E2","E2",{"$f":"$BI$22","v":"E1"},"D4","D3","D3","D3","D3","D3","D3","D3","D3",null,null,"",{"$f":"IF(ROW(CU18)>COUNTA(CU:CU),\"\",INDEX(CU:CU,SMALL(IF(CU$2:CU$100<>\"\",ROW($2:$100)),ROW(CU18))))","v":{"$error":"#NUM!"}},"","",{"$f":"Spieler!C19","v":""},"",{"$f":"Spieler!N19","v":""},{"$f":"IF(ROW(CX18)>COUNTA(CX:CX),\"\",INDEX(CX:CX,SMALL(IF(CX$2:CX$100<>\"\",ROW($2:$100)),ROW(CX18))))","v":{"$error":"#NUM!"}},"",{"$f":"VLOOKUP(DC19,Spieler!$I$2:$J$41,2,FALSE)","v":{"$error":"#N/A"}},null,null,null,"","",{"$f":"IFERROR(LARGE($DH$2:$DH$41,10),\"\")","v":""},"",null,"",""]
[null,null,null,null,null,null,null,null,null,null,null,null,null,null,null,null,{"$f":"IF(V20=\"\",\"\",8)","v":""},58,"","B",{"$f":"C15","v":"B3"},{"$f":"IF(X20=\"\",\"\",D15)","v":""},"B5","","","","",{"$f":"Matches!O20","v":0},{"$f":"Matches!P20","v":0},null,null,0,0,0,0,0,0,null,null,null,null,null,null,null,null,null,null,null,null,null,null,null,null,null,null,null,null,"",null,"","D4",null,null,null,null,null,null,null,null,null,null,null,"F3","F2",{"$f":"$BI$27","v":"F1"},"E3",{"$f":"BI24","v":"E3"},{"$f":"$BI$32","v":"G1"},"F3","F2",{"$f":"$BI$27","v":"F1"},"E3","E3","E3","E3","E3","E2",{"$f":"$BI$22","v":"E1"},"D4","D4","D4","D4","D4","D4","D4","D4",null,null,"",{"$f":"IF(ROW(CU19)>COUNTA(CU:CU),\"\",INDEX(CU:CU,SMALL(IF(CU$2:CU$100<>\"\",ROW($2:$100)),ROW(CU19))))","v":{"$error":"#NUM!"}},"","",{"$f":"Spieler!C20","v":""},"",{"$f":"Spieler!N20","v":""},{"$f":"IF(ROW(CX19)>COUNTA(CX:CX),\"\",INDEX(CX:CX,SMALL(IF(CX$2:CX$100<>\"\",ROW($2:$100)),ROW(CX19))))","v":{"$error":"#NUM!"}},"",{"$f":"VLOOKUP(DC20,Spieler!$I$2:$J$41,2,FALSE)","v":{"$error":"#N/A"}},null,null,null,"","",{"$f":"IFERROR(LARGE($DH$2:$DH$41,11),\"\")","v":""},"",null,"",""]
[null,null,null,null,null,null,null,null,null,null,null,null,null,null,null,null,{"$f":"IF(V21=\"\",\"\",9)","v":""},{"$f":"IF(B16=4,10,66)","v":66},"","B",{"$f":"C13","v":"B1"},{"$f":"IF(X21=\"\",\"\",D15)","v":""},{"$f":"C16","v":"B4"},{"$f":"D16","v":""},"","","",{"$f":"Matches!O21","v":0},{"$f":"Matches!P21","v":0},null,null,0,0,0,0,0,0,null,null,null,null,null,null,null,null,null,null,null,null,null,null,null,null,null,null,null,null,"",null,"","D5",null,null,null,null,null,null,null,null,null,null,null,null,"F3","F2",{"$f":"$BI$27","v":"F1"},{"$f":"BI25","v":"E4"},"G2",{"$f":"$BI$32","v":"G1"},"F3","F2",{"$f":"$BI$27","v":"F1"},"E4","E4","E4","E4","E3","E2",{"$f":"$BI$22","v":"E1"},"D5","D5","D5","D5","D5","D5","D5",null,null,"",{"$f":"IF(ROW(CU20)>COUNTA(CU:CU),\"\",INDEX(CU:CU,SMALL(IF(CU$2:CU$100<>\"\",ROW($2:$100)),ROW(CU20))))","v":{"$error":"#NUM!"}},"","",{"$f":"Spieler!C21","v":""},"",{"$f":"Spieler!N21","v":""},{"$f":"IF(ROW(CX20)>COUNTA(CX:CX),\"\",INDEX(CX:CX,SMALL(IF(CX$2:CX$100<>\"\",ROW($2:$100)),ROW(CX20))))","v":{"$error":"#NUM!"}},"",{"$f":"VLOOKUP(DC21,Spieler!$I$2:$J$41,2,FALSE)","v":{"$error":"#N/A"}},null,null,null,"","",{"$f":"IFERROR(LARGE($DH$2:$DH$41,12),\"\")","v":""},"",null,"",""]
[null,null,null,null,null,null,null,null,null,null,null,null,null,null,null,null,{"$f":"IF(V22=\"\",\"\",10)","v":""},74,"","B",{"$f":"C14","v":"B2"},{"$f":"IF(X22=\"\",\"\",D14)","v":""},{"$f":"C17","v":"B5"},{"$f":"D17","v":""},"","","",{"$f":"Matches!O22","v":0},{"$f":"Matches!P22","v":0},null,null,0,0,0,0,0,0,null,null,null,null,null,null,null,null,null,null,null,null,null,null,null,null,null,null,null,null,"",null,"",{"$f":"IF($CS$1=\"X\",\"\",\"E1\")","v":"E1"},null,null,null,null,null,null,null,null,null,null,null,null,null,"F3","F2",{"$f":"BI27","v":"F1"},"G3","G2",{"$f":"$BI$32","v":"G1"},"F3","F2",{"$f":"$BI$27","v":"F1"},{"$f":"$BI$27","v":"F1"},{"$f":"$BI$27","v":"F1"},{"$f":"$BI$27","v":"F1"},"E4","E3","E2",{"$f":"$BI$22","v":"E1"},{"$f":"$BI$22","v":"E1"},{"$f":"$BI$22","v":"E1"},{"$f":"$BI$22","v":"E1"},{"$f":"$BI$22","v":"E1"},"E1","",null,null,{"$f":"IF($CQ$1<8,\"\",IF(CS6=CR22,\"\",CR22))","v":""},{"$f":"IF(ROW(CU21)>COUNTA(CU:CU),\"\",INDEX(CU:CU,SMALL(IF(CU$2:CU$100<>\"\",ROW($2:$100)),ROW(CU21))))","v":{"$error":"#NUM!"}},"","",{"$f":"Spieler!C22","v":""},"",{"$f":"Spieler!N22","v":""},{"$f":"IF(ROW(CX21)>COUNTA(CX:CX),\"\",INDEX(CX:CX,SMALL(IF(CX$2:CX$100<>\"\",ROW($2:$100)),ROW(CX21))))","v":{"$error":"#NUM!"}},"",{"$f":"VLOOKUP(DC22,Spieler!$I$2:$J$41,2,FALSE)","v":{"$error":"#N/A"}},null,null,null,"","",{"$f":"IFERROR(LARGE($DH$2:$DH$41,13),\"\")","v":""},"",null,"",""]
["C",null,null,"Spieler","M","W","L","F+","F-","U",null,null,"Rang","Rang","P+",null,null,null,"",null,null,null,null,null,"","","",{"$f":"Matches!O23","v":0},{"$f":"Matches!P23","v":0},null,null,null,null,null,null,null,null,null,null,null,null,null,null,null,null,null,null,null,null,null,null,null,null,null,null,null,null,"",null,"","E2",null,null,null,null,null,null,null,null,null,null,null,null,null,null,"F3",{"$f":"BI28","v":"F2"},{"$f":"$BI$37","v":"H1"},"G3","G2",{"$f":"$BI$32","v":"G1"},"F3","F2","F2","F2","F2",{"$f":"$BI$27","v":"F1"},"E4","E3","E2","E2","E2","E2","E2","E2","",null,null,"",{"$f":"IF(ROW(CU22)>COUNTA(CU:CU),\"\",INDEX(CU:CU,SMALL(IF(CU$2:CU$100<>\"\",ROW($2:$100)),ROW(CU22))))","v":{"$error":"#NUM!"}},"","",{"$f":"Spieler!C23","v":""},"",{"$f":"Spieler!N23","v":""},{"$f":"IF(ROW(CX22)>COUNTA(CX:CX),\"\",INDEX(CX:CX,SMALL(IF(CX$2:CX$100<>\"\",ROW($2:$100)),ROW(CX22))))","v":{"$error":"#NUM!"}},"",{"$f":"VLOOKUP(DC23,Spieler!$I$2:$J$41,2,FALSE)","v":{"$error":"#N/A"}},null,null,null,"","",{"$f":"IFERROR(LARGE($DH$2:$DH$41,14),\"\")","v":""},"",null,"",""]
[null,1,"C1",{"$f":"'1. Runde Gruppen'!D11","v":""},{"$f":"AJ24+AJ27+AJ30+AJ26","v":0},{"$f":"AH24+AH27+AH30+AH26","v":0},{"$f":"AI24+AI27+AI30+AI26","v":0},{"$f":"AF24+AF27+AF30+AF26","v":0},{"$f":"AG24+AG27+AG30+AG26","v":0},{"$f":"AK24+AK27+AK30+AK26","v":0},null,null,{"$f":"IF(D24=\"X\",-200000,IF(D24=\"Y\",-200000,IF(D24=\"Z\",-200000,IF(D24=\"\",-200000,IF(D24=\"Z Freilos\",-200000,IF(D24=\"\",(-90000),(F24*10000)+(H24*1000)+(J24*10)+E24-(G24*10000)-(I24*1000)+O24))))))","v":-200000},{"$f":"IF(E24=0,\"\",RANK(M24,M24:M28))","v":""},{"$f":"'1. Runde Gruppen'!O11","v":0},{"$f":"IF(D24=\"\",\"\",D24)","v":""},{"$f":"IF(V24=\"\",\"\",1)","v":""},3,"","C",{"$f":"C24","v":"C1"},{"$f":"D24","v":""},{"$f":"C25","v":"C2"},{"$f":"D25","v":""},"","","",{"$f":"Matches!O24","v":0},{"$f":"Matches!P24","v":0},null,null,{"$f":"IFERROR(VLOOKUP(S24,$Y$2:$AC$88,4,FALSE),\"\")","v":0},{"$f":"IFERROR(VLOOKUP(S24,$Y$2:$AC$88,5,FALSE),\"\")","v":0},{"$f":"IF(AF24>AG24,1,0)","v":0},{"$f":"IF(AG24>AF24,1,0)","v":0},{"$f":"IF(AF24+AG24>=1,1,0)","v":0},{"$f":"IF(AND(AF24+AG24>1,AF24=AG24),1,0)","v":0},null,null,null,null,null,null,null,null,null,null,null,null,null,null,null,null,null,null,null,null,"",null,"","E3",null,null,null,null,null,null,null,null,null,null,null,null,null,null,null,{"$f":"BI29","v":"F3"},"H2",{"$f":"$BI$37","v":"H1"},"G3","G2",{"$f":"$BI$32","v":"G1"},"F3","F3","F3","F3","F2",{"$f":"$BI$27","v":"F1"},"E4","E3","E3","E3","E3","E3","E3","",null,null,"",{"$f":"IF(ROW(CU23)>COUNTA(CU:CU),\"\",INDEX(CU:CU,SMALL(IF(CU$2:CU$100<>\"\",ROW($2:$100)),ROW(CU23))))","v":{"$error":"#NUM!"}},"","",{"$f":"Spieler!C24","v":""},"",{"$f":"Spieler!N24","v":""},{"$f":"IF(ROW(CX23)>COUNTA(CX:CX),\"\",INDEX(CX:CX,SMALL(IF(CX$2:CX$100<>\"\",ROW($2:$100)),ROW(CX23))))","v":{"$error":"#NUM!"}},"",{"$f":"VLOOKUP(DC24,Spieler!$I$2:$J$41,2,FALSE)","v":{"$error":"#N/A"}},null,null,null,"","",{"$f":"IFERROR(LARGE($DH$2:$DH$41,15),\"\")","v":""},"",null,"",""]
[null,2,"C2",{"$f":"'1. Runde Gruppen'!D12","v":""},{"$f":"AJ24+AJ29+AJ25+AJ33","v":0},{"$f":"AI24+AH25+AH29+AH33","v":0},{"$f":"AH24+AI29+AI25+AI33","v":0},{"$f":"AG24+AF33+AF29+AF25","v":0},{"$f":"AF24+AG25+AG29+AG33","v":0},{"$f":"AK24+AK29+AK25+AK33","v":0},null,null,{"$f":"IF(D25=\"X\",-200000,IF(D25=\"Y\",-200000,IF(D25=\"Z\",-200000,IF(D25=\"\",-200000,IF(D25=\"Z Freilos\",-200000,IF(D25=\"\",(-90000),(F25*10000)+(H25*1000)+(J25*10)+E25-(G25*10000)-(I25*1000)+O25))))))","v":-200000},{"$f":"IF(E25=0,\"\",RANK(M25,M24:M28))","v":""},{"$f":"'1. Runde Gruppen'!O12","v":0},{"$f":"IF(D25=\"\",\"\",D25)","v":""},{"$f":"IF(V25=\"\",\"\",2)","v":""},{"$f":"IF(B27=4,43,11)","v":11},{"$f":"IF(Q25=\"\",\"\",R25)","v":""},"C",{"$f":"C26","v":"C3"},{"$f":"IF(X25=\"\",\"\",D25)","v":""},{"$f":"C27","v":"C4"},{"$f":"D27","v":""},"","","",{"$f":"Matches!O25","v":0},{"$f":"Matches!P25","v":0},null,null,{"$f":"IFERROR(VLOOKUP(S25,$Y$2:$AC$88,4,FALSE),\"\")","v":0},{"$f":"IFERROR(VLOOKUP(S25,$Y$2:$AC$88,5,FALSE),\"\")","v":0},0,0,{"$f":"IF(AF25+AG25>=1,1,0)","v":0},{"$f":"IF(AND(AF25+AG25>1,AF25=AG25),1,0)","v":0},null,null,null,null,null,null,null,null,null,null,null,null,null,null,null,null,null,null,null,null,"",null,"","E4",null,null,null,null,null,null,null,null,null,null,null,null,null,null,null,null,"H3","H2",{"$f":"$BI$37","v":"H1"},"G3","G2",{"$f":"$BI$32","v":"G1"},"F4","F4","F4","F3","F2",{"$f":"$BI$27","v":"F1"},"E4","E4","E4","E4","E4","E4","E4",null,null,"",{"$f":"IF(ROW(CU24)>COUNTA(CU:CU),\"\",INDEX(CU:CU,SMALL(IF(CU$2:CU$100<>\"\",ROW($2:$100)),ROW(CU24))))","v":{"$error":"#NUM!"}},"","",{"$f":"Spieler!C25","v":""},"",{"$f":"Spieler!N25","v":""},{"$f":"IF(ROW(CX24)>COUNTA(CX:CX),\"\",INDEX(CX:CX,SMALL(IF(CX$2:CX$100<>\"\",ROW($2:$100)),ROW(CX24))))","v":{"$error":"#NUM!"}},"",{"$f":"VLOOKUP(DC25,Spieler!$I$2:$J$41,2,FALSE)","v":{"$error":"#N/A"}},null,null,null,"","",{"$f":"IFERROR(LARGE($DH$2:$DH$41,16),\"\")","v":""},"",null,"",""]
[null,3,"C3",{"$f":"'1. Runde Gruppen'!D13","v":""},{"$f":"AJ27+AJ29+AJ32+AJ31","v":0},{"$f":"AI27+AI29+AH32+AH31","v":0},{"$f":"AH27+AH29+AI32+AI31","v":0},{"$f":"AG27+AG29+AF32+AF31","v":0},{"$f":"AF27+AF29+AG32+AG31","v":0},{"$f":"AK27+AK29+AK32+AK31","v":0},null,null,{"$f":"IF(D26=\"X\",-200000,IF(D26=\"Y\",-200000,IF(D26=\"Z\",-200000,IF(D26=\"\",-200000,IF(D26=\"Z Freilos\",-200000,IF(D26=\"\",(-90000),(F26*10000)+(H26*1000)+(J26*10)+E26-(G26*10000)-(I26*1000)+O26))))))","v":-200000},{"$f":"IF(E26=0,\"\",RANK(M26,M24:M28))","v":""},{"$f":"'1. Runde Gruppen'!O13","v":0},{"$f":"IF(D26=\"\",\"\",D26)","v":""},{"$f":"IF(V26=\"\",\"\",3)","v":""},19,"","C",{"$f":"C24","v":"C1"},{"$f":"IF(X26=\"\",\"\",D24)","v":""},{"$f":"C28","v":"C5"},{"$f":"D28","v":""},"","","",{"$f":"Matches!O26","v":0},{"$f":"Matches!P26","v":0},null,null,{"$f":"IFERROR(VLOOKUP(S26,$Y$2:$AC$88,4,FALSE),\"\")","v":0},0,0,0,{"$f":"IF(AF26+AG26>=1,1,0)","v":0},0,null,null,null,null,null,null,null,null,null,null,null,null,null,null,null,null,null,null,null,null,"",null,"","E5",null,null,null,null,null,null,null,null,null,null,null,null,null,null,null,null,null,"H3","H2",{"$f":"$BI$37","v":"H1"},"G3","G2",{"$f":"$BI$32","v":"G1"},{"$f":"$BI$32","v":"G1"},{"$f":"$BI$32","v":"G1"},"F4","F3","F2",{"$f":"$BI$27","v":"F1"},"E5","E5","E5","E5","E5","E5",null,null,"",{"$f":"IF(ROW(CU25)>COUNTA(CU:CU),\"\",INDEX(CU:CU,SMALL(IF(CU$2:CU$100<>\"\",ROW($2:$100)),ROW(CU25))))","v":{"$error":"#NUM!"}},"","",{"$f":"Spieler!C26","v":""},"",{"$f":"Spieler!N26","v":""},{"$f":"IF(ROW(CX25)>COUNTA(CX:CX),\"\",INDEX(CX:CX,SMALL(IF(CX$2:CX$100<>\"\",ROW($2:$100)),ROW(CX25))))","v":{"$error":"#NUM!"}},"",{"$f":"VLOOKUP(DC26,Spieler!$I$2:$J$41,2,FALSE)","v":{"$error":"#N/A"}},null,null,null,"","",{"$f":"IFERROR(LARGE($DH$2:$DH$41,17),\"\")","v":""},"",null,"",""]
[null,{"$f":"IF(D27=\"\",\"\",4)","v":""},"C4",{"$f":"'1. Runde Gruppen'!D14","v":""},{"$f":"AJ25+AJ28+AJ30+AJ32","v":0},{"$f":"AI25+AH28+AI30+AI32","v":0},{"$f":"AH25+AH30+AH32+AI28","v":0},{"$f":"AG25+AF28+AG30+AG32","v":0},{"$f":"AF25+AG28+AF30+AF32","v":0},{"$f":"AK25+AK30+AK32+AK28","v":0},null,null,{"$f":"IF(D27=\"X\",-200000,IF(D27=\"Y\",-200000,IF(D27=\"Z\",-200000,IF(D27=\"\",-200000,IF(D27=\"Z Freilos\",-200000,IF(D27=\"\",(-90000),(F27*10000)+(H27*1000)+(J27*10)+E27-(G27*10000)-(I27*1000)+O27))))))","v":-200000},{"$f":"IF(E27=0,\"\",RANK(M27,M24:M28))","v":""},{"$f":"'1. Runde Gruppen'!O14","v":0},{"$f":"IF(D27=\"\",\"\",D27)","v":""},{"$f":"IF(V27=\"\",\"\",4)","v":""},27,"","C",{"$f":"C25","v":"C2"},{"$f":"D24","v":""},{"$f":"C26","v":"C3"},{"$f":"D26","v":""},"","","",{"$f":"Matches!O27","v":0},{"$f":"Matches!P27","v":0},null,null,0,0,0,0,0,0,null,null,null,null,null,null,null,null,null,null,null,null,null,null,null,null,null,null,null,null,"",null,"",{"$f":"IF($CS$1=\"X\",\"\",\"F1\")","v":"F1"},null,null,null,null,null,null,null,null,null,null,null,null,null,null,null,null,null,null,"H3","H2",{"$f":"$BI$37","v":"H1"},"G3","G2","G2","G2",{"$f":"$BI$32","v":"G1"},"F4","F3","F2",{"$f":"$BI$27","v":"F1"},{"$f":"$BI$27","v":"F1"},{"$f":"$BI$27","v":"F1"},{"$f":"$BI$27","v":"F1"},"F1","",null,null,{"$f":"IF($CQ$1<8,\"\",IF(CS7=CR27,\"\",CR27))","v":""},{"$f":"IF(ROW(CU26)>COUNTA(CU:CU),\"\",INDEX(CU:CU,SMALL(IF(CU$2:CU$100<>\"\",ROW($2:$100)),ROW(CU26))))","v":{"$error":"#NUM!"}},"","",{"$f":"Spieler!C27","v":""},"",{"$f":"Spieler!N27","v":""},{"$f":"IF(ROW(CX26)>COUNTA(CX:CX),\"\",INDEX(CX:CX,SMALL(IF(CX$2:CX$100<>\"\",ROW($2:$100)),ROW(CX26))))","v":{"$error":"#NUM!"}},"",{"$f":"VLOOKUP(DC27,Spieler!$I$2:$J$41,2,FALSE)","v":{"$error":"#N/A"}},null,null,null,"","",{"$f":"IFERROR(LARGE($DH$2:$DH$41,18),\"\")","v":""},"",null,"",""]
[null,{"$f":"IF(D28=\"\",\"\",5)","v":""},"C5",{"$f":"'1. Runde Gruppen'!D15","v":""},{"$f":"AJ26+AJ28+AJ31+AJ33","v":0},{"$f":"AI26+AI28+AI31+AI33","v":0},{"$f":"AH26+AH28+AH31+AH33","v":0},{"$f":"AG26+AG28+AG31+AG33","v":0},{"$f":"AF26+AF28+AF31+AF33","v":0},{"$f":"AK26+AK28+AK31+AK33","v":0},null,null,{"$f":"IF(D28=\"X\",-200000,IF(D28=\"Y\",-200000,IF(D28=\"Z\",-200000,IF(D28=\"\",-200000,IF(D28=\"Z Freilos\",-200000,IF(D28=\"\",(-90000),(F28*10000)+(H28*1000)+(J28*10)+E28-(G28*10000)-(I28*1000)+O28))))))","v":-200000},{"$f":"IF(E28=0,\"\",RANK(M28,M24:M28))","v":""},{"$f":"'1. Runde Gruppen'!O15","v":0},{"$f":"IF(D28=\"\",\"\",D28)","v":""},{"$f":"IF(V28=\"\",\"\",5)","v":""},35,"","C",{"$f":"C27","v":"C4"},{"$f":"IF(X28=\"\",\"\",D27)","v":""},{"$f":"C28","v":"C5"},{"$f":"D28","v":""},{"$f":"IFERROR(SMALL($S$2:$S$88,ROW()-1),\"\")","v":""},"","",{"$f":"Matches!O28","v":0},{"$f":"Matches!P28","v":0},null,null,0,0,0,0,0,0,null,null,null,null,null,null,null,null,null,null,null,null,null,null,null,null,null,null,null,null,"",null,"","F2",null,null,null,null,null,null,null,null,null,null,null,null,null,null,null,null,null,null,null,"H3","H2",{"$f":"$BI$37","v":"H1"},"G3","G3","G3","G2",{"$f":"$BI$32","v":"G1"},"F4","F3","F2","F2","F2","F2","F2","",null,null,"",{"$f":"IF(ROW(CU27)>COUNTA(CU:CU),\"\",INDEX(CU:CU,SMALL(IF(CU$2:CU$100<>\"\",ROW($2:$100)),ROW(CU27))))","v":{"$error":"#NUM!"}},"","",{"$f":"Spieler!C28","v":""},"",{"$f":"Spieler!N28","v":""},{"$f":"IF(ROW(CX27)>COUNTA(CX:CX),\"\",INDEX(CX:CX,SMALL(IF(CX$2:CX$100<>\"\",ROW($2:$100)),ROW(CX27))))","v":{"$error":"#NUM!"}},"",{"$f":"VLOOKUP(DC28,Spieler!$I$2:$J$41,2,FALSE)","v":{"$error":"#N/A"}},null,null,null,"","",{"$f":"IFERROR(LARGE($DH$2:$DH$41,19),\"\")","v":""},"",null,"",""]
[null,null,null,null,null,null,null,null,null,null,null,null,null,null,null,null,{"$f":"IF(V29=\"\",\"\",6)","v":""},{"$f":"IF(B27=4,67,43)","v":43},"","C",{"$f":"C24","v":"C1"},{"$f":"D25","v":""},{"$f":"C26","v":"C3"},"","","","",{"$f":"Matches!O29","v":0},{"$f":"Matches!P29","v":0},null,null,0,0,0,0,0,0,null,null,null,null,null,null,null,null,null,null,null,null,null,null,null,null,null,null,null,null,"",null,"","F3",null,null,null,null,null,null,null,null,null,null,null,null,null,null,null,null,null,null,null,null,"H3","H2",{"$f":"$BI$37","v":"H1"},"G4","G4","G3","G2",{"$f":"$BI$32","v":"G1"},"F4","F3","F3","F3","F3","F3","",null,null,"",{"$f":"IF(ROW(CU28)>COUNTA(CU:CU),\"\",INDEX(CU:CU,SMALL(IF(CU$2:CU$100<>\"\",ROW($2:$100)),ROW(CU28))))","v":{"$error":"#NUM!"}},"","",{"$f":"Spieler!C29","v":""},"",{"$f":"Spieler!N29","v":""},{"$f":"IF(ROW(CX28)>COUNTA(CX:CX),\"\",INDEX(CX:CX,SMALL(IF(CX$2:CX$100<>\"\",ROW($2:$100)),ROW(CX28))))","v":{"$error":"#NUM!"}},"",{"$f":"VLOOKUP(DC29,Spieler!$I$2:$J$41,2,FALSE)","v":{"$error":"#N/A"}},null,null,null,"","",{"$f":"IFERROR(LARGE($DH$2:$DH$41,20),\"\")","v":""},"",null,"",""]
[null,null,null,null,null,null,null,null,null,null,null,null,null,null,null,null,{"$f":"IF(V30=\"\",\"\",7)","v":""},51,"","C",{"$f":"C25","v":"C2"},{"$f":"IF(X30=\"\",\"\",D24)","v":""},"C4","","","","",{"$f":"Matches!O30","v":0},{"$f":"Matches!P30","v":0},null,null,0,0,0,0,0,0,null,null,null,null,null,null,null,null,null,null,null,null,null,null,null,null,null,null,null,null,"",null,"","F4",null,null,null,null,null,null,null,null,null,null,null,null,null,null,null,null,null,null,null,null,null,"H3","H2",{"$f":"$BI$37","v":"H1"},{"$f":"$BI$37","v":"H1"},"G4","G3","G2",{"$f":"$BI$32","v":"G1"},"F4","F4","F4","F4","F4",{"$f":"CS72","v":"F4"},null,null,{"$f":"IF($CQ$1<8,\"\",IF(CS30=CR30,\"\",CR30))","v":""},{"$f":"IF(ROW(CU29)>COUNTA(CU:CU),\"\",INDEX(CU:CU,SMALL(IF(CU$2:CU$100<>\"\",ROW($2:$100)),ROW(CU29))))","v":{"$error":"#NUM!"}},"","",{"$f":"Spieler!C30","v":""},"",{"$f":"Spieler!N30","v":""},{"$f":"IF(ROW(CX29)>COUNTA(CX:CX),\"\",INDEX(CX:CX,SMALL(IF(CX$2:CX$100<>\"\",ROW($2:$100)),ROW(CX29))))","v":{"$error":"#NUM!"}},"",{"$f":"VLOOKUP(DC30,Spieler!$I$2:$J$41,2,FALSE)","v":{"$error":"#N/A"}},null,null,null,"","",{"$f":"IFERROR(LARGE($DH$2:$DH$41,21),\"\")","v":""},"",null,"",""]
[null,null,null,null,null,null,null,null,null,null,null,null,null,null,null,null,{"$f":"IF(V31=\"\",\"\",8)","v":""},59,"","C",{"$f":"C26","v":"C3"},{"$f":"IF(X31=\"\",\"\",D26)","v":""},"C5","","","","",{"$f":"Matches!O31","v":0},{"$f":"Matches!P31","v":0},null,null,0,0,0,0,0,0,null,null,null,null,null,null,null,null,null,null,null,null,null,null,null,null,null,null,null,null,"",null,"","F5",null,null,null,null,null,null,null,null,null,null,null,null,null,null,null,null,null,null,null,null,null,null,"H3","H2","H2",{"$f":"$BI$37","v":"H1"},"G4","G3","G2",{"$f":"$BI$32","v":"G1"},"F5","F5","F5","F5","F5",null,null,"",{"$f":"IF(ROW(CU30)>COUNTA(CU:CU),\"\",INDEX(CU:CU,SMALL(IF(CU$2:CU$100<>\"\",ROW($2:$100)),ROW(CU30))))","v":{"$error":"#NUM!"}},"","",{"$f":"Spieler!C31","v":""},"",{"$f":"Spieler!N31","v":""},{"$f":"IF(ROW(CX30)>COUNTA(CX:CX),\"\",INDEX(CX:CX,SMALL(IF(CX$2:CX$100<>\"\",ROW($2:$100)),ROW(CX30))))","v":{"$error":"#NUM!"}},"",{"$f":"VLOOKUP(DC31,Spieler!$I$2:$J$41,2,FALSE)","v":{"$error":"#N/A"}},null,null,null,"","",{"$f":"IFERROR(LARGE($DH$2:$DH$41,22),\"\")","v":""},"",null,"",""]
[null,null,null,null,null,null,null,null,null,null,null,null,null,null,null,null,{"$f":"IF(V32=\"\",\"\",9)","v":""},{"$f":"IF(B27=4,11,67)","v":67},"","C",{"$f":"C24","v":"C1"},{"$f":"IF(X32=\"\",\"\",D26)","v":""},{"$f":"C27","v":"C4"},{"$f":"D27","v":""},"","","",{"$f":"Matches!O32","v":0},{"$f":"Matches!P32","v":0},null,null,0,0,0,0,0,0,null,null,null,null,null,null,null,null,null,null,null,null,null,null,null,null,null,null,null,null,"",null,"",{"$f":"IF($CS$1=\"X\",\"\",\"G1\")","v":"G1"},null,null,null,null,null,null,null,null,null,null,null,null,null,null,null,null,null,null,null,null,null,null,null,"H3","H3","H2",{"$f":"$BI$37","v":"H1"},"G4","G3","G2",{"$f":"$BI$32","v":"G1"},{"$f":"$BI$32","v":"G1"},{"$f":"$BI$32","v":"G1"},"G1","G1",null,null,{"$f":"IF($CQ$1<8,\"\",IF(CS8=CR32,\"\",CR32))","v":""},{"$f":"IF(ROW(CU31)>COUNTA(CU:CU),\"\",INDEX(CU:CU,SMALL(IF(CU$2:CU$100<>\"\",ROW($2:$100)),ROW(CU31))))","v":{"$error":"#NUM!"}},"","",{"$f":"Spieler!C32","v":""},"",{"$f":"Spieler!N32","v":""},{"$f":"IF(ROW(CX31)>COUNTA(CX:CX),\"\",INDEX(CX:CX,SMALL(IF(CX$2:CX$100<>\"\",ROW($2:$100)),ROW(CX31))))","v":{"$error":"#NUM!"}},"",{"$f":"VLOOKUP(DC32,Spieler!$I$2:$J$41,2,FALSE)","v":{"$error":"#N/A"}},null,null,null,"","",{"$f":"IFERROR(LARGE($DH$2:$DH$41,23),\"\")","v":""},"",null,"",""]
[null,null,null,null,null,null,null,null,null,null,null,null,null,null,null,null,{"$f":"IF(V33=\"\",\"\",10)","v":""},75,"","C",{"$f":"C25","v":"C2"},{"$f":"IF(X33=\"\",\"\",D25)","v":""},{"$f":"C28","v":"C5"},{"$f":"D28","v":""},"","","",{"$f":"Matches!O33","v":0},{"$f":"Matches!P33","v":0},null,null,0,0,0,0,0,0,null,null,null,null,null,null,null,null,null,null,null,null,null,null,null,null,null,null,null,null,"",null,"","G2",null,null,null,null,null,null,null,null,null,null,null,null,null,null,null,null,null,null,null,null,null,null,null,null,"H4","H3","H2",{"$f":"$BI$37","v":"H1"},"G4","G3","G2","G2","G2","G2","G2",null,null,{"$f":"IF($CQ$1<8,\"\",IF(CS8=CR33,\"\",CR33))","v":""},{"$f":"IF(ROW(CU32)>COUNTA(CU:CU),\"\",INDEX(CU:CU,SMALL(IF(CU$2:CU$100<>\"\",ROW($2:$100)),ROW(CU32))))","v":{"$error":"#NUM!"}},"","",{"$f":"Spieler!C33","v":""},"",{"$f":"Spieler!N33","v":""},{"$f":"IF(ROW(CX32)>COUNTA(CX:CX),\"\",INDEX(CX:CX,SMALL(IF(CX$2:CX$100<>\"\",ROW($2:$100)),ROW(CX32))))","v":{"$error":"#NUM!"}},{"$f":"IFERROR(IF(DB33>\"\",DB33,\"\"),\"\")","v":""},{"$f":"VLOOKUP(DC33,Spieler!$I$2:$J$41,2,FALSE)","v":{"$error":"#N/A"}},null,null,null,"","",{"$f":"IFERROR(LARGE($DH$2:$DH$41,24),\"\")","v":""},"",null,"",""]
["D",null,null,"Spieler","M","W","L","F+","F-","U",null,null,"Rang","Rang","P+",null,null,null,"",null,null,null,null,null,"","","",{"$f":"Matches!O34","v":0},{"$f":"Matches!P34","v":0},null,null,null,null,null,null,null,null,null,null,null,null,null,null,null,null,null,null,null,null,null,null,null,null,null,null,null,null,"",null,"","G3",null,null,null,null,null,null,null,null,null,null,null,null,null,null,null,null,null,null,null,null,null,null,null,null,null,"H4","H3","H2",{"$f":"$BI$37","v":"H1"},"G4","G3","G3","G3","G3","G3",null,null,"",{"$f":"IF(ROW(CU33)>COUNTA(CU:CU),\"\",INDEX(CU:CU,SMALL(IF(CU$2:CU$100<>\"\",ROW($2:$100)),ROW(CU33))))","v":{"$error":"#NUM!"}},"","",{"$f":"Spieler!C34","v":""},"",{"$f":"Spieler!N34","v":""},{"$f":"IF(ROW(CX33)>COUNTA(CX:CX),\"\",INDEX(CX:CX,SMALL(IF(CX$2:CX$100<>\"\",ROW($2:$100)),ROW(CX33))))","v":{"$error":"#NUM!"}},"",{"$f":"VLOOKUP(DC34,Spieler!$I$2:$J$41,2,FALSE)","v":{"$error":"#N/A"}},null,null,null,"","",{"$f":"IFERROR(LARGE($DH$2:$DH$41,25),\"\")","v":""},"",null,"",""]
[null,1,"D1",{"$f":"'1. Runde Gruppen'!T11","v":""},{"$f":"AJ35+AJ38+AJ41+AJ37","v":0},{"$f":"AH35+AH38+AH41+AH37","v":0},{"$f":"AI35+AI38+AI41+AI37","v":0},{"$f":"AF35+AF38+AF41+AF37","v":0},{"$f":"AG35+AG38+AG41+AG37","v":0},{"$f":"AK35+AK38+AK41+AK37","v":0},null,null,{"$f":"IF(D35=\"X\",-200000,IF(D35=\"Y\",-200000,IF(D35=\"Z\",-200000,IF(D35=\"\",-200000,IF(D35=\"Z Freilos\",-200000,IF(D35=\"\",(-90000),(F35*10000)+(H35*1000)+(J35*10)+E35-(G35*10000)-(I35*1000)+O35))))))","v":-200000},{"$f":"IF(E35=0,\"\",RANK(M35,M35:M39))","v":""},{"$f":"'1. Runde Gruppen'!AE11","v":0},{"$f":"IF(D35=\"\",\"\",D35)","v":""},{"$f":"IF(V35=\"\",\"\",1)","v":""},4,"","D",{"$f":"C35","v":"D1"},{"$f":"D35","v":""},{"$f":"C36","v":"D2"},{"$f":"D36","v":""},"","","",{"$f":"Matches!O35","v":0},{"$f":"Matches!P35","v":0},null,null,{"$f":"VLOOKUP(S35,$Y$2:$AC$88,4,FALSE)","v":0},{"$f":"VLOOKUP(S35,$Y$2:$AC$88,5,FALSE)","v":0},{"$f":"IF(AF35>AG35,1,0)","v":0},{"$f":"IF(AG35>AF35,1,0)","v":0},{"$f":"IF(AF35+AG35>=1,1,0)","v":0},{"$f":"IF(AND(AF35+AG35>1,AF35=AG35),1,0)","v":0},null,null,null,null,null,null,null,null,null,null,null,null,null,null,null,null,null,null,null,null,"",null,"","G4",null,null,null,null,null,null,null,null,null,null,null,null,null,null,null,null,null,null,null,null,null,null,null,null,null,null,"H4","H3","H2",{"$f":"$BI$37","v":"H1"},"G4","G4","G4","G4","G4",null,null,"",{"$f":"IF(ROW(CU34)>COUNTA(CU:CU),\"\",INDEX(CU:CU,SMALL(IF(CU$2:CU$100<>\"\",ROW($2:$100)),ROW(CU34))))","v":{"$error":"#NUM!"}},"","",{"$f":"Spieler!C35","v":""},"",{"$f":"Spieler!N35","v":""},{"$f":"IF(ROW(CX34)>COUNTA(CX:CX),\"\",INDEX(CX:CX,SMALL(IF(CX$2:CX$100<>\"\",ROW($2:$100)),ROW(CX34))))","v":{"$error":"#NUM!"}},"",{"$f":"VLOOKUP(DC35,Spieler!$I$2:$J$41,2,FALSE)","v":{"$error":"#N/A"}},null,null,null,"","",{"$f":"IFERROR(LARGE($DH$2:$DH$41,26),\"\")","v":""},"",null,"",""]
[null,2,"D2",{"$f":"'1. Runde Gruppen'!T12","v":""},{"$f":"AJ35+AJ40+AJ36+AJ44","v":0},{"$f":"AI35+AH36+AH40+AH44","v":0},{"$f":"AH35+AI40+AI36+AI44","v":0},{"$f":"AG35+AF44+AF40+AF36","v":0},{"$f":"AF35+AG36+AG40+AG44","v":0},{"$f":"AK35+AK40+AK36+AK44","v":0},null,null,{"$f":"IF(D36=\"X\",-200000,IF(D36=\"Y\",-200000,IF(D36=\"Z\",-200000,IF(D36=\"\",-200000,IF(D36=\"Z Freilos\",-200000,IF(D36=\"\",(-90000),(F36*10000)+(H36*1000)+(J36*10)+E36-(G36*10000)-(I36*1000)+O36))))))","v":-200000},{"$f":"IF(E36=0,\"\",RANK(M36,M35:M39))","v":""},{"$f":"'1. Runde Gruppen'!AE12","v":0},{"$f":"IF(D36=\"\",\"\",D36)","v":""},{"$f":"IF(V36=\"\",\"\",2)","v":""},{"$f":"IF(B38=4,44,12)","v":12},"","D",{"$f":"C37","v":"D3"},{"$f":"IF(X36=\"\",\"\",D36)","v":""},{"$f":"C38","v":"D4"},{"$f":"D38","v":""},"","","",{"$f":"Matches!O36","v":0},{"$f":"Matches!P36","v":0},null,null,{"$f":"VLOOKUP(S36,$Y$2:$AC$88,4,FALSE)","v":0},{"$f":"VLOOKUP(S36,$Y$2:$AC$88,5,FALSE)","v":0},0,0,{"$f":"IF(AF36+AG36>=1,1,0)","v":0},{"$f":"IF(AND(AF36+AG36>1,AF36=AG36),1,0)","v":0},null,null,null,null,null,null,null,null,null,null,null,null,null,null,null,null,null,null,null,null,"",null,"","G5",null,null,null,null,null,null,null,null,null,null,null,null,null,null,null,null,null,null,null,null,null,null,null,null,null,null,null,"H4","H3","H2",{"$f":"$BI$37","v":"H1"},"G5","G5","G5","G5",null,null,"",{"$f":"IF(ROW(CU35)>COUNTA(CU:CU),\"\",INDEX(CU:CU,SMALL(IF(CU$2:CU$100<>\"\",ROW($2:$100)),ROW(CU35))))","v":{"$error":"#NUM!"}},"","",{"$f":"Spieler!C36","v":""},"",{"$f":"Spieler!N36","v":""},{"$f":"IF(ROW(CX35)>COUNTA(CX:CX),\"\",INDEX(CX:CX,SMALL(IF(CX$2:CX$100<>\"\",ROW($2:$100)),ROW(CX35))))","v":{"$error":"#NUM!"}},"",{"$f":"VLOOKUP(DC36,Spieler!$I$2:$J$41,2,FALSE)","v":{"$error":"#N/A"}},null,null,null,"","",{"$f":"IFERROR(LARGE($DH$2:$DH$41,27),\"\")","v":""},"",null,"",""]
[null,3,"D3",{"$f":"'1. Runde Gruppen'!T13","v":""},{"$f":"AJ38+AJ40+AJ43+AJ42","v":0},{"$f":"AI38+AI40+AH43+AH42","v":0},{"$f":"AH38+AH40+AI43+AI42","v":0},{"$f":"AG38+AG40+AF43+AF42","v":0},{"$f":"AF38+AF40+AG43+AG42","v":0},{"$f":"AK38+AK40+AK43+AK42","v":0},null,null,{"$f":"IF(D37=\"X\",-200000,IF(D37=\"Y\",-200000,IF(D37=\"Z\",-200000,IF(D37=\"\",-200000,IF(D37=\"Z Freilos\",-200000,IF(D37=\"\",(-90000),(F37*10000)+(H37*1000)+(J37*10)+E37-(G37*10000)-(I37*1000)+O37))))))","v":-200000},{"$f":"IF(E37=0,\"\",RANK(M37,M35:M39))","v":""},{"$f":"'1. Runde Gruppen'!AE13","v":0},{"$f":"IF(D37=\"\",\"\",D37)","v":""},{"$f":"IF(V37=\"\",\"\",3)","v":""},20,"","D",{"$f":"C35","v":"D1"},{"$f":"IF(X37=\"\",\"\",D35)","v":""},{"$f":"C39","v":"D5"},{"$f":"D39","v":""},"","","",{"$f":"Matches!O37","v":0},{"$f":"Matches!P37","v":0},null,null,0,0,0,0,{"$f":"IF(AF37+AG37>=1,1,0)","v":0},0,null,null,null,null,null,null,null,null,null,null,null,null,null,null,null,null,null,null,null,null,"",null,"",{"$f":"IF($CS$1=\"X\",\"\",\"H1\")","v":"H1"},null,null,null,null,null,null,null,null,null,null,null,null,null,null,null,null,null,null,null,null,null,null,null,null,null,null,null,null,"H4","H3","H2",{"$f":"$BI$37","v":"H1"},{"$f":"$BI$37","v":"H1"},"H1","H1",null,null,{"$f":"IF($CQ$1<8,\"\",IF(CS9=CR37,\"\",CR37))","v":""},{"$f":"IF(ROW(CU36)>COUNTA(CU:CU),\"\",INDEX(CU:CU,SMALL(IF(CU$2:CU$100<>\"\",ROW($2:$100)),ROW(CU36))))","v":{"$error":"#NUM!"}},"","",{"$f":"Spieler!C37","v":""},"",{"$f":"Spieler!N37","v":""},{"$f":"IF(ROW(CX36)>COUNTA(CX:CX),\"\",INDEX(CX:CX,SMALL(IF(CX$2:CX$100<>\"\",ROW($2:$100)),ROW(CX36))))","v":{"$error":"#NUM!"}},"",{"$f":"VLOOKUP(DC37,Spieler!$I$2:$J$41,2,FALSE)","v":{"$error":"#N/A"}},null,null,null,"","",{"$f":"IFERROR(LARGE($DH$2:$DH$41,28),\"\")","v":""},"",null,"",""]
[null,{"$f":"IF(D38=\"\",\"\",4)","v":""},"D4",{"$f":"'1. Runde Gruppen'!T14","v":""},{"$f":"AJ36+AJ39+AJ41+AJ43","v":0},{"$f":"AI36+AH39+AI41+AI43","v":0},{"$f":"AH36+AH41+AH43+AI39","v":0},{"$f":"AG36+AF39+AG41+AG43","v":0},{"$f":"AF36+AG39+AF41+AF43","v":0},{"$f":"AK36+AK41+AK43+AK39","v":0},null,null,{"$f":"IF(D38=\"X\",-200000,IF(D38=\"Y\",-200000,IF(D38=\"Z\",-200000,IF(D38=\"\",-200000,IF(D38=\"Z Freilos\",-200000,IF(D38=\"\",(-90000),(F38*10000)+(H38*1000)+(J38*10)+E38-(G38*10000)-(I38*1000)+O38))))))","v":-200000},{"$f":"IF(E38=0,\"\",RANK(M38,M35:M39))","v":""},{"$f":"'1. Runde Gruppen'!AE14","v":0},{"$f":"IF(D38=\"\",\"\",D38)","v":""},{"$f":"IF(V38=\"\",\"\",4)","v":""},28,"","D",{"$f":"C36","v":"D2"},{"$f":"D35","v":""},{"$f":"C37","v":"D3"},{"$f":"D37","v":""},"","","",{"$f":"Matches!O38","v":0},{"$f":"Matches!P38","v":0},null,null,0,0,0,0,0,0,null,null,null,null,null,null,null,null,null,null,null,null,null,null,null,null,null,null,null,null,"",null,"","H2",null,null,null,null,null,null,null,null,null,null,null,null,null,null,null,null,null,null,null,null,null,null,null,null,null,null,null,null,null,"H4","H3","H2","H2","H2","H2",null,null,{"$f":"IF($CQ$1<8,\"\",IF(CS38=CR38,\"\",CR38))","v":""},{"$f":"IF(ROW(CU37)>COUNTA(CU:CU),\"\",INDEX(CU:CU,SMALL(IF(CU$2:CU$100<>\"\",ROW($2:$100)),ROW(CU37))))","v":{"$error":"#NUM!"}},"","",{"$f":"Spieler!C38","v":""},"",{"$f":"Spieler!N38","v":""},{"$f":"IF(ROW(CX37)>COUNTA(CX:CX),\"\",INDEX(CX:CX,SMALL(IF(CX$2:CX$100<>\"\",ROW($2:$100)),ROW(CX37))))","v":{"$error":"#NUM!"}},"",{"$f":"VLOOKUP(DC38,Spieler!$I$2:$J$41,2,FALSE)","v":{"$error":"#N/A"}},null,null,null,"","",{"$f":"IFERROR(LARGE($DH$2:$DH$41,29),\"\")","v":""},"",null,"",""]
[null,{"$f":"IF(D39=\"\",\"\",5)","v":""},"D5",{"$f":"'1. Runde Gruppen'!T15","v":""},{"$f":"AJ37+AJ39+AJ42+AJ44","v":0},{"$f":"AI37+AI39+AI42+AI44","v":0},{"$f":"AH37+AH39+AH42+AH44","v":0},{"$f":"AG37+AG39+AG42+AG44","v":0},{"$f":"AF37+AF39+AF42+AF44","v":0},{"$f":"AK37+AK39+AK42+AK44","v":0},null,null,{"$f":"IF(D39=\"X\",-200000,IF(D39=\"Y\",-200000,IF(D39=\"Z\",-200000,IF(D39=\"\",-200000,IF(D39=\"Z Freilos\",-200000,IF(D39=\"\",(-90000),(F39*10000)+(H39*1000)+(J39*10)+E39-(G39*10000)-(I39*1000)+O39))))))","v":-200000},{"$f":"IF(E39=0,\"\",RANK(M39,M35:M39))","v":""},{"$f":"'1. Runde Gruppen'!AE15","v":0},{"$f":"IF(D39=\"\",\"\",D39)","v":""},{"$f":"IF(V39=\"\",\"\",5)","v":""},36,"","D",{"$f":"C38","v":"D4"},{"$f":"IF(X39=\"\",\"\",D38)","v":""},{"$f":"C39","v":"D5"},{"$f":"D39","v":""},"","","",{"$f":"Matches!O39","v":0},{"$f":"Matches!P39","v":0},null,null,0,0,0,0,0,0,null,null,null,null,null,null,null,null,null,null,null,null,null,null,null,null,null,null,null,null,"",null,"","H3",null,null,null,null,null,null,null,null,null,null,null,null,null,null,null,null,null,null,null,null,null,null,null,null,null,null,null,null,null,null,"H4","H3","H3","H3","H3",null,null,{"$f":"IF($CQ$1<8,\"\",IF(CS39=CR39,\"\",CR39))","v":""},{"$f":"IF(ROW(CU38)>COUNTA(CU:CU),\"\",INDEX(CU:CU,SMALL(IF(CU$2:CU$100<>\"\",ROW($2:$100)),ROW(CU38))))","v":{"$error":"#NUM!"}},"","",{"$f":"Spieler!C39","v":""},{"$f":"VLOOKUP(CY39,$DM$2:$DN$49,2,FALSE)","v":""},{"$f":"Spieler!N39","v":""},{"$f":"IF(ROW(CX38)>COUNTA(CX:CX),\"\",INDEX(CX:CX,SMALL(IF(CX$2:CX$100<>\"\",ROW($2:$100)),ROW(CX38))))","v":{"$error":"#NUM!"}},"",{"$f":"VLOOKUP(DC39,Spieler!$I$2:$J$41,2,FALSE)","v":{"$error":"#N/A"}},null,null,null,"","",{"$f":"IFERROR(LARGE($DH$2:$DH$41,30),\"\")","v":""},"",null,"",""]
[null,null,null,null,null,null,null,null,null,null,null,null,null,null,null,null,{"$f":"IF(V40=\"\",\"\",6)","v":""},{"$f":"IF(B38=4,68,44)","v":44},"","D",{"$f":"C35","v":"D1"},{"$f":"D36","v":""},{"$f":"C37","v":"D3"},"","","","",{"$f":"Matches!O40","v":0},{"$f":"Matches!P40","v":0},null,null,0,0,0,0,0,0,null,null,null,null,null,null,null,null,null,null,null,null,null,null,null,null,null,null,null,null,"",null,"","H4",null,null,null,null,null,null,null,null,null,null,null,null,null,null,null,null,null,null,null,null,null,null,null,null,null,null,null,null,null,null,null,"H4","H4","H4","H4",null,null,"",{"$f":"IF(ROW(CU39)>COUNTA(CU:CU),\"\",INDEX(CU:CU,SMALL(IF(CU$2:CU$100<>\"\",ROW($2:$100)),ROW(CU39))))","v":{"$error":"#NUM!"}},"","",{"$f":"Spieler!C40","v":""},"",{"$f":"Spieler!N40","v":""},{"$f":"IF(ROW(CX39)>COUNTA(CX:CX),\"\",INDEX(CX:CX,SMALL(IF(CX$2:CX$100<>\"\",ROW($2:$100)),ROW(CX39))))","v":{"$error":"#NUM!"}},"",{"$f":"VLOOKUP(DC40,Spieler!$I$2:$J$41,2,FALSE)","v":{"$error":"#N/A"}},null,null,null,"","",{"$f":"IFERROR(LARGE($DH$2:$DH$41,31),\"\")","v":""},"",null,"",""]
[null,null,null,null,null,null,null,null,null,null,null,null,null,null,null,null,{"$f":"IF(V41=\"\",\"\",7)","v":""},52,"","D",{"$f":"C36","v":"D2"},{"$f":"IF(X41=\"\",\"\",D35)","v":""},"D4","","","","",{"$f":"Matches!O41","v":0},{"$f":"Matches!P41","v":0},null,null,0,0,0,0,0,0,null,null,null,null,null,null,null,null,null,null,null,null,null,null,null,null,null,null,null,null,"",null,"","H5",null,null,null,null,null,null,null,null,null,null,null,null,null,null,null,null,null,null,null,null,null,null,null,null,null,null,null,null,null,null,null,null,"H5","H5","H5",null,null,"",{"$f":"IF(ROW(CU40)>COUNTA(CU:CU),\"\",INDEX(CU:CU,SMALL(IF(CU$2:CU$100<>\"\",ROW($2:$100)),ROW(CU40))))","v":{"$error":"#NUM!"}},"","",{"$f":"Spieler!C41","v":""},"",{"$f":"Spieler!N41","v":""},{"$f":"IF(ROW(CX40)>COUNTA(CX:CX),\"\",INDEX(CX:CX,SMALL(IF(CX$2:CX$100<>\"\",ROW($2:$100)),ROW(CX40))))","v":{"$error":"#NUM!"}},"",{"$f":"VLOOKUP(DC41,Spieler!$I$2:$J$41,2,FALSE)","v":{"$error":"#N/A"}},null,null,null,"","",{"$f":"IFERROR(LARGE($DH$2:$DH$41,32),\"\")","v":""},"",null,"",""]
[null,null,null,null,null,null,null,null,null,null,null,null,null,null,null,null,{"$f":"IF(V42=\"\",\"\",8)","v":""},60,"","D",{"$f":"C37","v":"D3"},{"$f":"IF(X42=\"\",\"\",D37)","v":""},"D5","","","","",{"$f":"Matches!O42","v":0},{"$f":"Matches!P42","v":0},null,null,0,0,0,0,0,0,null,null,null,null,null,null,null,null,null,null,null,null,null,null,null,null,null,null,null,null,"",null,"",null,null,null,null,null,null,null,null,null,null,null,null,null,{"$f":"IF(AND(Spieler!AG1=\"X\",CQ43=24),\"X\",IF(CQ43<21,Spieler!AG1,\"\"))","v":"X"},null,null,null,null,null,null,null,null,null,null,null,null,null,null,null,null,null,null,null,null,null,null,null,null,null,null,null,"",null,null,{"$f":"Spieler!N42","v":""},null,null,null,null,null,null,null,null,{"$f":"IFERROR(LARGE($DH$2:$DH$41,33),\"\")","v":""},"",null,{"$f":"DA42","v":""},""]
[null,null,null,null,null,null,null,null,null,null,null,null,null,null,null,null,{"$f":"IF(V43=\"\",\"\",9)","v":""},{"$f":"IF(B38=4,12,68)","v":68},"","D",{"$f":"C35","v":"D1"},{"$f":"IF(X43=\"\",\"\",D37)","v":""},{"$f":"C38","v":"D4"},{"$f":"D38","v":""},"","","",{"$f":"Matches!O43","v":0},{"$f":"Matches!P43","v":0},null,null,0,0,0,0,0,0,null,null,null,null,null,null,null,null,null,null,null,null,null,null,null,null,null,null,null,null,"",null,"",{"$f":"AW43","v":0},8,9,10,11,12,13,14,15,16,17,18,19,20,21,22,23,24,25,26,27,28,29,30,31,32,33,34,35,36,37,38,39,40,{"$f":"BH1","v":0},null,null,null,null,null,null,"",null,null,{"$f":"Spieler!N43","v":""},null,null,null,null,null,null,null,null,{"$f":"IFERROR(LARGE($DH$2:$DH$41,34),\"\")","v":""},"",null,"",""]
[null,null,null,null,null,null,null,null,null,null,null,null,null,null,null,null,{"$f":"IF(V44=\"\",\"\",10)","v":""},76,"","D",{"$f":"C36","v":"D2"},{"$f":"IF(X44=\"\",\"\",D36)","v":""},{"$f":"C39","v":"D5"},{"$f":"D39","v":""},"","","",{"$f":"Matches!O44","v":0},{"$f":"Matches!P44","v":0},null,null,{"$f":"VLOOKUP(S44,$Y$2:$AC$88,4,FALSE)","v":0},{"$f":"VLOOKUP(S44,$Y$2:$AC$88,5,FALSE)","v":0},0,0,0,0,null,null,null,null,null,null,null,null,null,null,null,null,null,null,null,null,null,null,null,null,"",null,"","A1","A1","A1","A1","A1","A1","A1","A1","A1","A1","A1","A1","A1","A1","A1","A1","A1","A1","A1","A1","A1","A1","A1","A1","A1","A1","A1","A1","A1","A1","A1","A1","A1","A1",{"$f":"IFERROR(LOOKUP($CQ$1,$BI$1:$CP$1,BI44:CP44),\"\")","v":"A1"},null,{"$f":"IF(CQ44=0,\"\",CQ44)","v":"A1"},{"$f":"IF(ROW(CS43)>COUNTA(CS43:CS100),\"\",INDEX(CS43:CS100,SMALL(IF(CS$43:CS$100<>\"\",ROW($43:$100)),ROW(CS43))))","v":""},null,null,null,"",null,null,{"$f":"Spieler!N44","v":""},null,null,null,null,null,null,null,null,{"$f":"IFERROR(LARGE($DH$2:$DH$41,35),\"\")","v":""},"",null,"",""]
["E",null,null,"Spieler","M","W","L","F+","F-","U",null,null,"Rang","Rang","P+",null,null,null,"",null,null,null,null,null,"","","",{"$f":"Matches!O45","v":0},{"$f":"Matches!P45","v":0},null,null,null,null,null,null,null,null,null,null,null,null,null,null,null,null,null,null,null,null,null,null,null,null,null,null,null,null,"",null,"","A2","A2","A2","A2","A2","A2","A2","A2","A2","A2","A2","A2","A2","A2","A2","A2","A2","A2","A2","A2","A2","A2","A2","A2","A2","A2","A2","A2","A2","A2","A2","A2","A2","A2",{"$f":"IFERROR(LOOKUP($CQ$1,$BI$1:$CP$1,BI45:CP45),\"\")","v":"A2"},null,{"$f":"IF(CQ45=0,\"\",CQ45)","v":"A2"},{"$f":"IF(ROW(CS44)>COUNTA(CS44:CS101),\"\",INDEX(CS44:CS101,SMALL(IF(CS$43:CS$100<>\"\",ROW($43:$100)),ROW(CS44))))","v":""},null,null,null,"",null,null,{"$f":"Spieler!N45","v":""},null,null,null,null,null,null,null,null,{"$f":"IFERROR(LARGE($DH$2:$DH$41,36),\"\")","v":""},"",null,"",""]
[null,1,"E1",{"$f":"'1. Runde Gruppen'!D19","v":""},{"$f":"AJ46+AJ49+AJ52+AJ48","v":0},{"$f":"AH46+AH49+AH52+AH48","v":0},{"$f":"AI46+AI49+AI52+AI48","v":0},{"$f":"AF46+AF49+AF52+AF48","v":0},{"$f":"AG46+AG49+AG52+AG48","v":0},{"$f":"AK46+AK49+AK52+AK48","v":0},null,null,{"$f":"IF(D46=\"X\",-200000,IF(D46=\"Y\",-200000,IF(D46=\"Z\",-200000,IF(D46=\"\",-200000,IF(D46=\"Z Freilos\",-200000,IF(D46=\"\",(-90000),(F46*10000)+(H46*1000)+(J46*10)+E46-(G46*10000)-(I46*1000)+O46))))))","v":-200000},{"$f":"IF(E46=0,\"\",RANK(M46,M46:M50))","v":""},{"$f":"'1. Runde Gruppen'!O19","v":0},{"$f":"IF(D46=\"\",\"\",D46)","v":""},{"$f":"IF(V46=\"\",\"\",1)","v":""},5,"","E",{"$f":"C46","v":"E1"},{"$f":"D46","v":""},{"$f":"C47","v":"E2"},{"$f":"D47","v":""},"","","",{"$f":"Matches!O46","v":0},{"$f":"Matches!P46","v":0},null,null,{"$f":"VLOOKUP(S46,$Y$2:$AC$88,4,FALSE)","v":0},{"$f":"VLOOKUP(S46,$Y$2:$AC$88,5,FALSE)","v":0},{"$f":"IF(AF46>AG46,1,0)","v":0},{"$f":"IF(AG46>AF46,1,0)","v":0},{"$f":"IF(AF46+AG46>=1,1,0)","v":0},{"$f":"IF(AND(AF46+AG46>1,AF46=AG46),1,0)","v":0},null,null,null,null,null,null,null,null,null,null,null,null,null,null,null,null,null,null,null,null,"",null,"","A3","A3","A3","A3","A3","A3","A3","A3","A3","A3","A3","A3","A3","A3","A3","A3","A3","A3","A3","A3","A3","A3","A3","A3","A3","A3","A3","A3","A3","A3","A3","A3","A3","A3","A3",null,"A3",{"$f":"IF(ROW(CS45)>COUNTA(CS45:CS102),\"\",INDEX(CS45:CS102,SMALL(IF(CS$43:CS$100<>\"\",ROW($43:$100)),ROW(CS45))))","v":""},null,null,null,"",null,null,{"$f":"Spieler!N46","v":""},null,null,null,null,null,null,null,null,{"$f":"IFERROR(LARGE($DH$2:$DH$41,37),\"\")","v":""},"",null,{"$f":"DA46","v":""},""]
[null,2,"E2",{"$f":"'1. Runde Gruppen'!D20","v":""},{"$f":"AJ46+AJ51+AJ47+AJ55","v":0},{"$f":"AI46+AH47+AH51+AH55","v":0},{"$f":"AH46+AI51+AI47+AI55","v":0},{"$f":"AG46+AF55+AF51+AF47","v":0},{"$f":"AF46+AG47+AG51+AG55","v":0},{"$f":"AK46+AK51+AK47+AK55","v":0},null,null,{"$f":"IF(D47=\"X\",-200000,IF(D47=\"Y\",-200000,IF(D47=\"Z\",-200000,IF(D47=\"\",-200000,IF(D47=\"Z Freilos\",-200000,IF(D47=\"\",(-90000),(F47*10000)+(H47*1000)+(J47*10)+E47-(G47*10000)-(I47*1000)+O47))))))","v":-200000},{"$f":"IF(E47=0,\"\",RANK(M47,M46:M50))","v":""},{"$f":"'1. Runde Gruppen'!O20","v":0},{"$f":"IF(D47=\"\",\"\",D47)","v":""},{"$f":"IF(V47=\"\",\"\",2)","v":""},{"$f":"IF(B49=4,45,13)","v":13},"","E",{"$f":"C48","v":"E3"},{"$f":"IF(X47=\"\",\"\",D47)","v":""},{"$f":"C49","v":"E4"},{"$f":"D49","v":""},"","","",{"$f":"Matches!O47","v":0},{"$f":"Matches!P47","v":0},null,null,{"$f":"VLOOKUP(S47,$Y$2:$AC$88,4,FALSE)","v":0},{"$f":"VLOOKUP(S47,$Y$2:$AC$88,5,FALSE)","v":0},0,0,{"$f":"IF(AF47+AG47>=1,1,0)","v":0},{"$f":"IF(AND(AF47+AG47>1,AF47=AG47),1,0)","v":0},null,null,null,null,null,null,null,null,null,null,null,null,null,null,null,null,null,null,null,null,"",null,"","A4","A4","A4","A4","A4",null,"A4","A4","A4","A4","A4",{"$f":"IF($BV$42=\"X\",\"A4\",\"\")","v":"A4"},"A4","A4","A4","A4","A4",{"$f":"IF($BV$42=\"X\",\"\",\"A4\")","v":""},"A4","A4","A4","A4","A4","A4","A4","A4","A4","A4","A4","A4","A4","A4","A4","A4",{"$f":"IFERROR(LOOKUP($CQ$1,$BI$1:$CP$1,BI47:CP47),\"\")","v":"A4"},null,{"$f":"IF(CQ47=0,\"\",CQ47)","v":"A4"},{"$f":"IF(ROW(CS46)>COUNTA(CS46:CS103),\"\",INDEX(CS46:CS103,SMALL(IF(CS$43:CS$100<>\"\",ROW($43:$100)),ROW(CS46))))","v":""},null,null,null,"",null,null,{"$f":"Spieler!N47","v":""},null,null,null,null,null,null,null,null,{"$f":"IFERROR(LARGE($DH$2:$DH$41,38),\"\")","v":""},"",null,{"$f":"DA47","v":""},""]
[null,3,"E3",{"$f":"'1. Runde Gruppen'!D21","v":""},{"$f":"AJ49+AJ51+AJ54+AJ53","v":0},{"$f":"AI49+AI51+AH54+AH53","v":0},{"$f":"AH49+AH51+AI54+AI53","v":0},{"$f":"AG49+AG51+AF54+AF53","v":0},{"$f":"AF49+AF51+AG54+AG53","v":0},{"$f":"AK49+AK51+AK54+AK53","v":0},null,null,{"$f":"IF(D48=\"X\",-200000,IF(D48=\"Y\",-200000,IF(D48=\"Z\",-200000,IF(D48=\"\",-200000,IF(D48=\"Z Freilos\",-200000,IF(D48=\"\",(-90000),(F48*10000)+(H48*1000)+(J48*10)+E48-(G48*10000)-(I48*1000)+O48))))))","v":-200000},{"$f":"IF(E48=0,\"\",RANK(M48,M46:M50))","v":""},{"$f":"'1. Runde Gruppen'!O21","v":0},{"$f":"IF(D48=\"\",\"\",D48)","v":""},{"$f":"IF(V48=\"\",\"\",3)","v":""},21,"","E",{"$f":"C46","v":"E1"},{"$f":"IF(X48=\"\",\"\",D46)","v":""},{"$f":"C50","v":"E5"},{"$f":"D50","v":""},"","","",{"$f":"Matches!O48","v":0},{"$f":"Matches!P48","v":0},null,null,0,0,0,0,{"$f":"IF(AF48+AG48>=1,1,0)","v":0},0,null,null,null,null,null,null,null,null,null,null,null,null,null,null,null,null,null,null,null,null,"",null,"","A5",null,"A5","A5",null,null,null,null,null,null,{"$f":"IF($BV$42=\"X\",\"A5\",\"\")","v":"A5"},{"$f":"IF($BV$42=\"X\",\"A5\",\"\")","v":"A5"},{"$f":"IF($BV$42=\"X\",\"A5\",\"\")","v":"A5"},{"$f":"IF($BV$42=\"X\",\"A5\",\"\")","v":"A5"},null,null,null,null,null,null,null,"B1","B1","B1","B1","B1","A5","A5","A5","A5","A5","A5","A5","A5","A5",null,"A5",{"$f":"IF(ROW(CS47)>COUNTA(CS47:CS104),\"\",INDEX(CS47:CS104,SMALL(IF(CS$43:CS$100<>\"\",ROW($43:$100)),ROW(CS47))))","v":""},null,null,null,"",null,null,{"$f":"Spieler!N48","v":""},null,null,null,null,null,null,null,null,{"$f":"IFERROR(LARGE($DH$2:$DH$41,39),\"\")","v":""},"",null,"",""]
[null,{"$f":"IF(D49=\"\",\"\",4)","v":""},"E4",{"$f":"'1. Runde Gruppen'!D22","v":""},{"$f":"AJ47+AJ50+AJ52+AJ54","v":0},{"$f":"AI47+AH50+AI52+AI54","v":0},{"$f":"AH47+AH52+AH54+AI50","v":0},{"$f":"AG47+AF50+AG52+AG54","v":0},{"$f":"AF47+AG50+AF52+AF54","v":0},{"$f":"AK47+AK52+AK54+AK50","v":0},null,null,{"$f":"IF(D49=\"X\",-200000,IF(D49=\"Y\",-200000,IF(D49=\"Z\",-200000,IF(D49=\"\",-200000,IF(D49=\"Z Freilos\",-200000,IF(D49=\"\",(-90000),(F49*10000)+(H49*1000)+(J49*10)+E49-(G49*10000)-(I49*1000)+O49))))))","v":-200000},{"$f":"IF(E49=0,\"\",RANK(M49,M46:M50))","v":""},{"$f":"'1. Runde Gruppen'!O22","v":0},{"$f":"IF(D49=\"\",\"\",D49)","v":""},{"$f":"IF(V49=\"\",\"\",4)","v":""},29,"","E",{"$f":"C47","v":"E2"},{"$f":"D46","v":""},{"$f":"C48","v":"E3"},{"$f":"D48","v":""},"","","",{"$f":"Matches!O49","v":0},{"$f":"Matches!P49","v":0},null,null,0,0,0,0,0,0,null,null,null,null,null,null,null,null,null,null,null,null,null,null,null,null,null,null,null,null,"",null,"","B1","B1","B1","B1","B1","B1","B1","B1","B1","B1","B1","B1","B1","B1","B1","B1","B1","B1","B1","B1","B1","B2","B2","B2","B2","B2","B1","B1","B1","B1","B1","B1","B1","B1","B1",null,"B1",{"$f":"IF(ROW(CS48)>COUNTA(CS48:CS105),\"\",INDEX(CS48:CS105,SMALL(IF(CS$43:CS$100<>\"\",ROW($43:$100)),ROW(CS48))))","v":""},null,null,null,"",null,null,{"$f":"Spieler!N49","v":""},null,null,null,null,null,null,null,null,{"$f":"IFERROR(LARGE($DH$2:$DH$41,40),\"\")","v":""},"",null,"",""]
[null,{"$f":"IF(D50=\"\",\"\",5)","v":""},"E5",{"$f":"'1. Runde Gruppen'!D23","v":""},{"$f":"AJ48+AJ50+AJ53+AJ55","v":0},{"$f":"AI48+AI50+AI53+AI55","v":0},{"$f":"AH48+AH50+AH53+AH55","v":0},{"$f":"AG48+AG50+AG53+AG55","v":0},{"$f":"AF48+AF50+AF53+AF55","v":0},{"$f":"AK48+AK50+AK53+AK55","v":0},null,null,{"$f":"IF(D50=\"X\",-200000,IF(D50=\"Y\",-200000,IF(D50=\"Z\",-200000,IF(D50=\"\",-200000,IF(D50=\"Z Freilos\",-200000,IF(D50=\"\",(-90000),(F50*10000)+(H50*1000)+(J50*10)+E50-(G50*10000)-(I50*1000)+O50))))))","v":-200000},{"$f":"IF(E50=0,\"\",RANK(M50,M46:M50))","v":""},{"$f":"'1. Runde Gruppen'!O23","v":0},{"$f":"IF(D50=\"\",\"\",D50)","v":""},{"$f":"IF(V50=\"\",\"\",5)","v":""},37,"","E",{"$f":"C49","v":"E4"},{"$f":"IF(X50=\"\",\"\",D49)","v":""},{"$f":"C50","v":"E5"},{"$f":"D50","v":""},"","","",{"$f":"Matches!O50","v":0},{"$f":"Matches!P50","v":0},null,null,0,0,0,0,0,0,null,null,null,null,null,null,null,null,null,null,null,null,null,null,null,null,null,null,null,null,"",null,"","B2","B2","B2","B2","B2","B2","B2","B2","B2","B2","B2","B2","B2","B2","B2","B2","B2","B2","B2","B2","B2","B3","B3","B3","B3","B3","B2","B2","B2","B2","B2","B2","B2","B2","B2",null,"B2",{"$f":"IF(ROW(CS49)>COUNTA(CS49:CS106),\"\",INDEX(CS49:CS106,SMALL(IF(CS$43:CS$100<>\"\",ROW($43:$100)),ROW(CS49))))","v":""}]
[null,null,null,null,null,null,null,null,null,null,null,null,null,null,null,null,{"$f":"IF(V51=\"\",\"\",6)","v":""},{"$f":"IF(B49=4,69,45)","v":45},"","E",{"$f":"C46","v":"E1"},{"$f":"D47","v":""},{"$f":"C48","v":"E3"},"","","","",{"$f":"Matches!O51","v":0},{"$f":"Matches!P51","v":0},null,null,0,0,0,0,0,0,null,null,null,null,null,null,null,null,null,null,null,null,null,null,null,null,null,null,null,null,"",null,"","B3","B3","B3","B3","B3","B3","B3","B3","B3","B3","B3","B3","B3","B3","B3","B3","B3","B3","B3","B3","B3","B4","B4","B4","B4","B4","B3","B3","B3","B3","B3","B3","B3","B3","B3",null,"B3",{"$f":"IF(ROW(CS50)>COUNTA(CS50:CS107),\"\",INDEX(CS50:CS107,SMALL(IF(CS$43:CS$100<>\"\",ROW($43:$100)),ROW(CS50))))","v":""}]
[null,null,null,null,null,null,null,null,null,null,null,null,null,null,null,null,{"$f":"IF(V52=\"\",\"\",7)","v":""},53,"","E",{"$f":"C47","v":"E2"},{"$f":"IF(X52=\"\",\"\",D46)","v":""},"E4","","","","",{"$f":"Matches!O52","v":0},{"$f":"Matches!P52","v":0},null,null,0,0,0,0,0,0,null,null,null,null,null,null,null,null,null,null,null,null,null,null,null,null,null,null,null,null,"",null,"","B4","B4","B4","B4","B4",null,null,"B4","B4","B4","B4",{"$f":"IF($BV$42=\"X\",\"B4\",\"\")","v":"B4"},{"$f":"IF($BV$42=\"X\",\"B4\",\"\")","v":"B4"},"B4","B4","B4","B4",{"$f":"IF($BV$42=\"x\",\"\",\"B4\")","v":""},null,"B4","B4",null,null,null,null,null,"B4","B4","B4","B4","B4","B4","B4","B4",{"$f":"IFERROR(LOOKUP($CQ$1,$BI$1:$CP$1,BI52:CP52),\"\")","v":"B4"},null,{"$f":"IF(CQ52=0,\"\",CQ52)","v":"B4"},{"$f":"IF(ROW(CS51)>COUNTA(CS51:CS108),\"\",INDEX(CS51:CS108,SMALL(IF(CS$43:CS$100<>\"\",ROW($43:$100)),ROW(CS51))))","v":""}]
[null,null,null,null,null,null,null,null,null,null,null,null,null,null,null,null,{"$f":"IF(V53=\"\",\"\",8)","v":""},61,"","E",{"$f":"C48","v":"E3"},{"$f":"IF(X53=\"\",\"\",D48)","v":""},"E5","","","","",{"$f":"Matches!O53","v":0},{"$f":"Matches!P53","v":0},null,null,0,0,0,0,0,0,null,null,null,null,null,null,null,null,null,null,null,null,null,null,null,null,null,null,null,null,"",null,"","B5",null,null,"B5",null,null,null,null,null,null,null,{"$f":"IF($BV$42=\"X\",\"B5\",\"\")","v":"B5"},{"$f":"IF($BV$42=\"X\",\"B5\",\"\")","v":"B5"},{"$f":"IF($BV$42=\"X\",\"B5\",\"\")","v":"B5"},null,null,null,null,null,null,null,null,null,null,null,null,null,"B5","B5","B5","B5","B5","B5","B5","B5",null,"B5",{"$f":"IF(ROW(CS52)>COUNTA(CS52:CS109),\"\",INDEX(CS52:CS109,SMALL(IF(CS$43:CS$100<>\"\",ROW($43:$100)),ROW(CS52))))","v":""}]
[null,null,null,null,null,null,null,null,null,null,null,null,null,null,null,null,{"$f":"IF(V54=\"\",\"\",9)","v":""},{"$f":"IF(B49=4,13,69)","v":69},"","E",{"$f":"C46","v":"E1"},{"$f":"IF(X54=\"\",\"\",D48)","v":""},{"$f":"C49","v":"E4"},{"$f":"D49","v":""},"","","",{"$f":"Matches!O54","v":0},{"$f":"Matches!P54","v":0},null,null,0,0,0,0,0,0,null,null,null,null,null,null,null,null,null,null,null,null,null,null,null,null,null,null,null,null,"",null,"","C1",null,null,null,"C1","C1","C1","C1","C1","C1","C1","C1","C1","C1","C1","C1","C1","C1","C1","C1","C1","C1","C1","C1","C1","C1","C1","C1","C1","C1","C1","C1","C1","C1","C1",null,"C1",{"$f":"IF(ROW(CS53)>COUNTA(CS53:CS110),\"\",INDEX(CS53:CS110,SMALL(IF(CS$43:CS$100<>\"\",ROW($43:$100)),ROW(CS53))))","v":""}]
[null,null,null,null,null,null,null,null,null,null,null,null,null,null,null,null,{"$f":"IF(V55=\"\",\"\",10)","v":""},77,"","E",{"$f":"C47","v":"E2"},{"$f":"IF(X55=\"\",\"\",D47)","v":""},{"$f":"C50","v":"E5"},{"$f":"D50","v":""},"","","",{"$f":"Matches!O55","v":0},{"$f":"Matches!P55","v":0},null,null,{"$f":"VLOOKUP(S55,$Y$2:$AC$88,4,FALSE)","v":0},{"$f":"VLOOKUP(S55,$Y$2:$AC$88,5,FALSE)","v":0},0,0,0,0,null,null,null,null,null,null,null,null,null,null,null,null,null,null,null,null,null,null,null,null,"",null,"","C2",null,null,null,"C2","C2","C2","C2","C2","C2","C2","C2","C2","C2","C2","C2","C2","C2","C2","C2","C2","C2","C2","C2","C2","C2","C2","C2","C2","C2","C2","C2","C2","C2","C2",null,"C2",{"$f":"IF(ROW(CS54)>COUNTA(CS54:CS111),\"\",INDEX(CS54:CS111,SMALL(IF(CS$43:CS$100<>\"\",ROW($43:$100)),ROW(CS54))))","v":""}]
["F",null,null,"Spieler","M","W","L","F+","F-","U",null,null,"Rang","Rang","P+",null,null,null,"",null,null,null,null,null,"","","",{"$f":"Matches!O56","v":0},{"$f":"Matches!P56","v":0},null,null,null,null,null,null,null,null,null,null,null,null,null,null,null,null,null,null,null,null,null,null,null,null,null,null,null,null,"",null,"","C3",null,null,null,"C3","C3","C3","C3","C3","C3","C3","C3","C3","C3","C3","C3","C3","C3","C3","C3","C3","C3","C3","C3","C3","C3","C3","C3","C3","C3","C3","C3","C3","C3","C3",null,"C3",{"$f":"IF(ROW(CS55)>COUNTA(CS55:CS112),\"\",INDEX(CS55:CS112,SMALL(IF(CS$43:CS$100<>\"\",ROW($43:$100)),ROW(CS55))))","v":""}]
[null,1,"F1",{"$f":"'1. Runde Gruppen'!T19","v":""},{"$f":"AJ57+AJ60+AJ63+AJ59","v":0},{"$f":"AH57+AH60+AH63+AH59","v":0},{"$f":"AI57+AI60+AI63+AI59","v":0},{"$f":"AF57+AF60+AF63+AF59","v":0},{"$f":"AG57+AG60+AG63+AG59","v":0},{"$f":"AK57+AK60+AK63+AK59","v":0},null,null,{"$f":"IF(D57=\"X\",-200000,IF(D57=\"Y\",-200000,IF(D57=\"Z\",-200000,IF(D57=\"\",-200000,IF(D57=\"Z Freilos\",-200000,IF(D57=\"\",(-90000),(F57*10000)+(H57*1000)+(J57*10)+E57-(G57*10000)-(I57*1000)+O57))))))","v":-200000},{"$f":"IF(E57=0,\"\",RANK(M57,M57:M61))","v":""},{"$f":"'1. Runde Gruppen'!AE19","v":0},{"$f":"IF(D57=\"\",\"\",D57)","v":""},{"$f":"IF(V57=\"\",\"\",1)","v":""},6,"","F",{"$f":"C57","v":"F1"},{"$f":"D57","v":""},{"$f":"C58","v":"F2"},{"$f":"D58","v":""},"","","",{"$f":"Matches!O57","v":0},{"$f":"Matches!P57","v":0},null,null,{"$f":"VLOOKUP(S57,$Y$2:$AC$88,4,FALSE)","v":0},{"$f":"VLOOKUP(S57,$Y$2:$AC$88,5,FALSE)","v":0},{"$f":"IF(AF57>AG57,1,0)","v":0},{"$f":"IF(AG57>AF57,1,0)","v":0},{"$f":"IF(AF57+AG57>=1,1,0)","v":0},{"$f":"IF(AND(AF57+AG57>1,AF57=AG57),1,0)","v":0},null,null,null,null,null,null,null,null,null,null,null,null,null,null,null,null,null,null,null,null,"",null,"","C4",null,null,null,null,null,null,null,"C4","C4",{"$f":"IF($BV$42=\"X\",\"C4\",\"\")","v":"C4"},{"$f":"IF($BV$42=\"X\",\"C4\",\"\")","v":"C4"},{"$f":"IF($BV$42=\"X\",\"C4\",\"\")","v":"C4"},{"$f":"IF($BV$42=\"X\",\"C4\",\"\")","v":"C4"},"C4","C4",{"$f":"BI57","v":"C4"},{"$f":"IF($BV$42=\"x\",\"\",\"C4\")","v":""},null,null,"C4","C4","C4","C4","C4","C4","C4","C4","C4","C4","C4","C4","C4","C4","C4",null,"C4",{"$f":"IF(ROW(CS56)>COUNTA(CS56:CS113),\"\",INDEX(CS56:CS113,SMALL(IF(CS$43:CS$100<>\"\",ROW($43:$100)),ROW(CS56))))","v":""}]
[null,2,"F2",{"$f":"'1. Runde Gruppen'!T20","v":""},{"$f":"AJ57+AJ62+AJ58+AJ66","v":0},{"$f":"AI57+AH58+AH62+AH66","v":0},{"$f":"AH57+AI62+AI58+AI66","v":0},{"$f":"AG57+AF66+AF62+AF58","v":0},{"$f":"AF57+AG58+AG62+AG66","v":0},{"$f":"AK57+AK62+AK58+AK66","v":0},null,null,{"$f":"IF(D58=\"X\",-200000,IF(D58=\"Y\",-200000,IF(D58=\"Z\",-200000,IF(D58=\"\",-200000,IF(D58=\"Z Freilos\",-200000,IF(D58=\"\",(-90000),(F58*10000)+(H58*1000)+(J58*10)+E58-(G58*10000)-(I58*1000)+O58))))))","v":-200000},{"$f":"IF(E58=0,\"\",RANK(M58,M57:M61))","v":""},{"$f":"'1. Runde Gruppen'!AE20","v":0},{"$f":"IF(D58=\"\",\"\",D58)","v":""},{"$f":"IF(V58=\"\",\"\",2)","v":""},{"$f":"IF(B60=4,46,14)","v":14},"","F",{"$f":"C59","v":"F3"},{"$f":"IF(X58=\"\",\"\",D58)","v":""},{"$f":"C60","v":"F4"},{"$f":"D60","v":""},"","","",{"$f":"Matches!O58","v":0},{"$f":"Matches!P58","v":0},null,null,{"$f":"VLOOKUP(S58,$Y$2:$AC$88,4,FALSE)","v":0},{"$f":"VLOOKUP(S58,$Y$2:$AC$88,5,FALSE)","v":0},0,0,{"$f":"IF(AF58+AG58>=1,1,0)","v":0},{"$f":"IF(AND(AF58+AG58>1,AF58=AG58),1,0)","v":0},null,null,null,null,null,null,null,null,null,null,null,null,null,null,null,null,null,null,null,null,"",null,"","C5",null,null,null,null,null,null,null,null,null,null,null,{"$f":"IF($BV$42=\"X\",\"C5\",\"\")","v":"C5"},{"$f":"IF($BV$42=\"X\",\"C5\",\"\")","v":"C5"},null,null,null,null,null,null,null,null,null,null,null,null,null,null,"C5","C5","C5","C5","C5","C5","C5",null,"C5",{"$f":"IF(ROW(CS57)>COUNTA(CS57:CS114),\"\",INDEX(CS57:CS114,SMALL(IF(CS$43:CS$100<>\"\",ROW($43:$100)),ROW(CS57))))","v":""}]
[null,3,"F3",{"$f":"'1. Runde Gruppen'!T21","v":""},{"$f":"AJ60+AJ62+AJ65+AJ64","v":0},{"$f":"AI60+AI62+AH65+AH64","v":0},{"$f":"AH60+AH62+AI65+AI64","v":0},{"$f":"AG60+AG62+AF65+AF64","v":0},{"$f":"AF60+AF62+AG65+AG64","v":0},{"$f":"AK60+AK62+AK65+AK64","v":0},null,null,{"$f":"IF(D59=\"X\",-200000,IF(D59=\"Y\",-200000,IF(D59=\"Z\",-200000,IF(D59=\"\",-200000,IF(D59=\"Z Freilos\",-200000,IF(D59=\"\",(-90000),(F59*10000)+(H59*1000)+(J59*10)+E59-(G59*10000)-(I59*1000)+O59))))))","v":-200000},{"$f":"IF(E59=0,\"\",RANK(M59,M57:M61))","v":""},{"$f":"'1. Runde Gruppen'!AE21","v":0},{"$f":"IF(D59=\"\",\"\",D59)","v":""},{"$f":"IF(V59=\"\",\"\",3)","v":""},22,"","F",{"$f":"C57","v":"F1"},{"$f":"IF(X59=\"\",\"\",D57)","v":""},{"$f":"C61","v":"F5"},{"$f":"D61","v":""},"","","",{"$f":"Matches!O59","v":0},{"$f":"Matches!P59","v":0},null,null,0,0,0,0,{"$f":"IF(AF59+AG59>=1,1,0)","v":0},0,null,null,null,null,null,null,null,null,null,null,null,null,null,null,null,null,null,null,null,null,"",null,"","D1",null,null,null,null,"D1","D1","D1","D1","D1","D1","D1","D1","D1","D1","D1","D1","D1","D1","D1","D1","D1","D1","D1","D1","D1","D1","D1","D1","D1","D1","D1","D1","D1",{"$f":"IFERROR(LOOKUP($CQ$1,$BI$1:$CP$1,BI59:CP59),\"\")","v":"D1"},null,"D1",{"$f":"IF(ROW(CS58)>COUNTA(CS58:CS115),\"\",INDEX(CS58:CS115,SMALL(IF(CS$43:CS$100<>\"\",ROW($43:$100)),ROW(CS58))))","v":""}]
[null,{"$f":"IF(D60=\"\",\"\",4)","v":""},"F4",{"$f":"'1. Runde Gruppen'!T22","v":""},{"$f":"AJ58+AJ61+AJ63+AJ65","v":0},{"$f":"AI58+AH61+AI63+AI65","v":0},{"$f":"AH58+AH63+AH65+AI61","v":0},{"$f":"AG58+AF61+AG63+AG65","v":0},{"$f":"AF58+AG61+AF63+AF65","v":0},{"$f":"AK58+AK63+AK65+AK61","v":0},null,null,{"$f":"IF(D60=\"X\",-200000,IF(D60=\"Y\",-200000,IF(D60=\"Z\",-200000,IF(D60=\"\",-200000,IF(D60=\"Z Freilos\",-200000,IF(D60=\"\",(-90000),(F60*10000)+(H60*1000)+(J60*10)+E60-(G60*10000)-(I60*1000)+O60))))))","v":-200000},{"$f":"IF(E60=0,\"\",RANK(M60,M57:M61))","v":""},{"$f":"'1. Runde Gruppen'!AE22","v":0},{"$f":"IF(D60=\"\",\"\",D60)","v":""},{"$f":"IF(V60=\"\",\"\",4)","v":""},30,"","F",{"$f":"C58","v":"F2"},{"$f":"D57","v":""},{"$f":"C59","v":"F3"},{"$f":"D59","v":""},"","","",{"$f":"Matches!O60","v":0},{"$f":"Matches!P60","v":0},null,null,0,0,0,0,0,0,null,null,null,null,null,null,null,null,null,null,null,null,null,null,null,null,null,null,null,null,"",null,"","D2",null,null,null,null,"D2","D2","D2","D2","D2","D2","D2","D2","D2","D2","D2","D2","D2","D2","D2","D2","D2","D2","D2","D2","D2","D2","D2","D2","D2","D2","D2","D2","D2","D2",null,"D2"]
[null,{"$f":"IF(D61=\"\",\"\",5)","v":""},"F5",{"$f":"'1. Runde Gruppen'!T23","v":""},{"$f":"AJ59+AJ61+AJ64+AJ66","v":0},{"$f":"AI59+AI61+AI64+AI66","v":0},{"$f":"AH59+AH61+AH64+AH66","v":0},{"$f":"AG59+AG61+AG64+AG66","v":0},{"$f":"AF59+AF61+AF64+AF66","v":0},{"$f":"AK59+AK61+AK64+AK66","v":0},null,null,{"$f":"IF(D61=\"X\",-200000,IF(D61=\"Y\",-200000,IF(D61=\"Z\",-200000,IF(D61=\"\",-200000,IF(D61=\"Z Freilos\",-200000,IF(D61=\"\",(-90000),(F61*10000)+(H61*1000)+(J61*10)+E61-(G61*10000)-(I61*1000)+O61))))))","v":-200000},{"$f":"IF(E61=0,\"\",RANK(M61,M57:M61))","v":""},{"$f":"'1. Runde Gruppen'!AE23","v":0},{"$f":"IF(D61=\"\",\"\",D61)","v":""},{"$f":"IF(V61=\"\",\"\",5)","v":""},38,"","F",{"$f":"C60","v":"F4"},{"$f":"IF(X61=\"\",\"\",D60)","v":""},{"$f":"C61","v":"F5"},{"$f":"D61","v":""},"","","",{"$f":"Matches!O61","v":0},{"$f":"Matches!P61","v":0},null,null,0,0,0,0,0,0,null,null,null,null,null,null,null,null,null,null,null,null,null,null,null,null,null,null,null,null,"",null,"","D3",null,null,null,null,"D3","D3","D3","D3","D3","D3","D3","D3","D3","D3","D3","D3","D3","D3","D3","D3","D3","D3","D3","D3","D3","D3","D3","D3","D3","D3","D3","D3","D3","D3",null,"D3"]
[null,null,null,null,null,null,null,null,null,null,null,null,null,null,null,null,{"$f":"IF(V62=\"\",\"\",6)","v":""},{"$f":"IF(B60=4,70,46)","v":46},"","F",{"$f":"C57","v":"F1"},{"$f":"D58","v":""},{"$f":"C59","v":"F3"},"","","","",{"$f":"Matches!O62","v":0},{"$f":"Matches!P62","v":0},null,null,0,0,0,0,0,0,null,null,null,null,null,null,null,null,null,null,null,null,null,null,null,null,null,null,null,null,"",null,"","D4",null,null,null,null,null,null,null,null,"D4",{"$f":"IF($BV$42=\"X\",\"D4\",\"\")","v":"D4"},{"$f":"IF($BV$42=\"X\",\"D4\",\"\")","v":"D4"},{"$f":"IF($BV$42=\"X\",\"D4\",\"\")","v":"D4"},{"$f":"IF($BV$42=\"X\",\"D4\",\"\")","v":"D4"},null,"D4",{"$f":"BI62","v":"D4"},{"$f":"IF($BV$42=\"x\",\"\",\"D4\")","v":""},null,null,null,"D4","D4","D4","D4","D4","D4","D4","D4","D4","D4","D4","D4","D4","D4",null,"D4"]
[null,null,null,null,null,null,null,null,null,null,null,null,null,null,null,null,{"$f":"IF(V63=\"\",\"\",7)","v":""},54,"","F",{"$f":"C58","v":"F2"},{"$f":"IF(X63=\"\",\"\",D57)","v":""},"F4","","","","",{"$f":"Matches!O63","v":0},{"$f":"Matches!P63","v":0},null,null,0,0,0,0,0,0,null,null,null,null,null,null,null,null,null,null,null,null,null,null,null,null,null,null,null,null,"",null,"","D5",null,null,null,null,null,null,null,null,null,null,null,null,{"$f":"IF($BV$42=\"X\",\"D5\",\"\")","v":"D5"},null,null,null,null,null,null,null,null,null,null,null,null,null,null,null,"D5","D5","D5","D5","D5","D5",null,"D5"]
[null,null,null,null,null,null,null,null,null,null,null,null,null,null,null,null,{"$f":"IF(V64=\"\",\"\",8)","v":""},62,"","F",{"$f":"C59","v":"F3"},{"$f":"IF(X64=\"\",\"\",D59)","v":""},"F5","","","","",{"$f":"Matches!O64","v":0},{"$f":"Matches!P64","v":0},null,null,0,0,0,0,0,0,null,null,null,null,null,null,null,null,null,null,null,null,null,null,null,null,null,null,null,null,"",null,"","E1",null,null,null,null,null,null,null,null,null,"E1","E1","E1","E1","E1","E1","E1","E1","E1","E1","E1","E1","E1","E1","E1","E1","E1","E1","E1","E1","E1","E1","E1","E1",{"$f":"IFERROR(IF(AND($BV$42=\"X\",$CQ$43<21),\"\",LOOKUP($CQ$1,$BI$1:$CP$1,BI64:CP64)),\"\")","v":""},null,{"$f":"IF(AND($CQ$43>20,$BV$42=\"X\"),CQ64,IF(CQ64=0,\"\",CQ64))","v":""}]
[null,null,null,null,null,null,null,null,null,null,null,null,null,null,null,null,{"$f":"IF(V65=\"\",\"\",9)","v":""},{"$f":"IF(B60=4,14,70)","v":70},"","F",{"$f":"C57","v":"F1"},{"$f":"IF(X65=\"\",\"\",D59)","v":""},{"$f":"C60","v":"F4"},{"$f":"D60","v":""},"","","",{"$f":"Matches!O65","v":0},{"$f":"Matches!P65","v":0},null,null,0,0,0,0,0,0,null,null,null,null,null,null,null,null,null,null,null,null,null,null,null,null,null,null,null,null,"",null,"","E2",null,null,null,null,null,null,null,null,null,"E2","E2","E2","E2","E2","E2","E2","E2","E2","E2","E2","E2","E2","E2","E2","E2","E2","E2","E2","E2","E2","E2","E2","E2",{"$f":"IFERROR(IF(AND($BV$42=\"X\",$CQ$43<21),\"\",LOOKUP($CQ$1,$BI$1:$CP$1,BI65:CP65)),\"\")","v":""},null,{"$f":"IF(AND($CQ$43>20,$BV$42=\"X\"),CQ65,IF(CQ65=0,\"\",CQ65))","v":""}]
[null,null,null,null,null,null,null,null,null,null,null,null,null,null,null,null,{"$f":"IF(V66=\"\",\"\",10)","v":""},78,"","F",{"$f":"C58","v":"F2"},{"$f":"IF(X66=\"\",\"\",D58)","v":""},{"$f":"C61","v":"F5"},{"$f":"D61","v":""},"","","",{"$f":"Matches!O66","v":0},{"$f":"Matches!P66","v":0},null,null,{"$f":"VLOOKUP(S66,$Y$2:$AC$88,4,FALSE)","v":0},{"$f":"VLOOKUP(S66,$Y$2:$AC$88,5,FALSE)","v":0},0,0,0,0,null,null,null,null,null,null,null,null,null,null,null,null,null,null,null,null,null,null,null,null,"",null,"","E3",null,null,null,null,null,null,null,null,null,"E3","E3","E3","E3","E3","E3","E3","E3","E3","E3","E3","E3","E3","E3","E3","E3","E3","E3","E3","E3","E3","E3","E3","E3",{"$f":"IFERROR(IF(AND($BV$42=\"X\",$CQ$43<21),\"\",LOOKUP($CQ$1,$BI$1:$CP$1,BI66:CP66)),\"\")","v":""},null,{"$f":"IF(AND($CQ$43>20,$BV$42=\"X\"),CQ66,IF(CQ66=0,\"\",CQ66))","v":""}]
["G",null,null,"Spieler","M","W","L","F+","F-","U",null,null,"Rang","Rang","P+",null,null,null,{"$f":"IF(Q67=\"\",\"\",R67)","v":""},null,null,null,null,null,{"$f":"IFERROR(SMALL($S$2:$S$88,ROW()-1),\"\")","v":""},{"$f":"IFERROR(IF(Y67=\"\",\"\",VLOOKUP(Y67,$S$1:$V$88,4,FALSE)),\"\")","v":""},{"$f":"IFERROR(IF(Y67=\"\",\"\",VLOOKUP(Y67,$S$1:$X$88,6,FALSE)),\"\")","v":""},{"$f":"Matches!O67","v":0},{"$f":"Matches!P67","v":0},null,null,null,null,null,null,null,null,null,null,null,null,null,null,null,null,null,null,null,null,null,null,null,null,null,null,null,null,{"$f":"IF(Y67=\"\",\"\",VLOOKUP(Y67,$S$2:$T$88,2,FALSE))","v":""},null,{"$f":"IF(Y67=\"\",\"\",IF(Y67>0,ROW()-1))","v":""},"E4",null,null,null,null,null,null,null,null,null,null,null,null,null,null,null,{"$f":"BI67","v":"E4"},{"$f":"IF($BV$42=\"x\",\"\",\"E4\")","v":""},null,null,null,null,"E4","E4","E4","E4","E4","E4","E4","E4","E4","E4","E4","E4","E4",null,"E4"]
[null,1,"G1",{"$f":"'1. Runde Gruppen'!D27","v":""},{"$f":"AJ68+AJ71+AJ74+AJ70","v":0},{"$f":"AH68+AH71+AH74+AH70","v":0},{"$f":"AI68+AI71+AI74+AI70","v":0},{"$f":"AF68+AF71+AF74+AF70","v":0},{"$f":"AG68+AG71+AG74+AG70","v":0},{"$f":"AK68+AK71+AK74+AK70","v":0},null,null,{"$f":"IF(D68=\"X\",-200000,IF(D68=\"Y\",-200000,IF(D68=\"Z\",-200000,IF(D68=\"\",-200000,IF(D68=\"Z Freilos\",-200000,IF(D68=\"\",(-90000),(F68*10000)+(H68*1000)+(J68*10)+E68-(G68*10000)-(I68*1000)+O68))))))","v":-200000},{"$f":"IF(E68=0,\"\",RANK(M68,M68:M72))","v":""},{"$f":"'1. Runde Gruppen'!O27","v":0},{"$f":"IF(D68=\"\",\"\",D68)","v":""},{"$f":"IF(V68=\"\",\"\",1)","v":""},7,"","G",{"$f":"C68","v":"G1"},{"$f":"D68","v":""},{"$f":"C69","v":"G2"},{"$f":"D69","v":""},"","","",{"$f":"Matches!O68","v":0},{"$f":"Matches!P68","v":0},null,null,{"$f":"VLOOKUP(S68,$Y$2:$AC$88,4,FALSE)","v":0},{"$f":"VLOOKUP(S68,$Y$2:$AC$88,5,FALSE)","v":0},{"$f":"IF(AF68>AG68,1,0)","v":0},{"$f":"IF(AG68>AF68,1,0)","v":0},{"$f":"IF(AF68+AG68>=1,1,0)","v":0},{"$f":"IF(AND(AF68+AG68>1,AF68=AG68),1,0)","v":0},null,null,null,null,null,null,null,null,null,null,null,null,null,null,null,null,null,null,null,null,"",null,"","E5",null,null,null,null,null,null,null,null,null,null,null,null,null,null,null,null,null,null,null,null,null,null,null,null,null,null,null,null,null,"E5","E5","E5","E5","E5",null,"E5"]
[null,2,"G2",{"$f":"'1. Runde Gruppen'!D28","v":""},{"$f":"AJ68+AJ73+AJ69+AJ77","v":0},{"$f":"AI68+AH69+AH73+AH77","v":0},{"$f":"AH68+AI73+AI69+AI77","v":0},{"$f":"AG68+AF77+AF73+AF69","v":0},{"$f":"AF68+AG69+AG73+AG77","v":0},{"$f":"AK68+AK73+AK69+AK77","v":0},null,null,{"$f":"IF(D69=\"X\",-200000,IF(D69=\"Y\",-200000,IF(D69=\"Z\",-200000,IF(D69=\"\",-200000,IF(D69=\"Z Freilos\",-200000,IF(D69=\"\",(-90000),(F69*10000)+(H69*1000)+(J69*10)+E69-(G69*10000)-(I69*1000)+O69))))))","v":-200000},{"$f":"IF(E69=0,\"\",RANK(M69,M68:M72))","v":""},{"$f":"'1. Runde Gruppen'!O28","v":0},{"$f":"IF(D69=\"\",\"\",D69)","v":""},{"$f":"IF(V69=\"\",\"\",2)","v":""},{"$f":"IF(B71=4,47,15)","v":15},"","G",{"$f":"C70","v":"G3"},{"$f":"IF(X69=\"\",\"\",D69)","v":""},{"$f":"C71","v":"G4"},{"$f":"D71","v":""},"","","",{"$f":"Matches!O69","v":0},{"$f":"Matches!P69","v":0},null,null,{"$f":"VLOOKUP(S69,$Y$2:$AC$88,4,FALSE)","v":0},{"$f":"VLOOKUP(S69,$Y$2:$AC$88,5,FALSE)","v":0},0,0,{"$f":"IF(AF69+AG69>=1,1,0)","v":0},{"$f":"IF(AND(AF69+AG69>1,AF69=AG69),1,0)","v":0},null,null,null,null,null,null,null,null,null,null,null,null,null,null,null,null,null,null,null,null,"",null,"","F1",null,null,null,null,null,null,null,null,null,null,"F1","F1","F1","F1","F1","F1","F1","F1","F1","F1","F1","F1","F1","F1","F1","F1","F1","F1","F1","F1","F1","F1","F1",{"$f":"IFERROR(IF(AND($BV$42=\"X\",$CQ$43<21),\"\",LOOKUP($CQ$1,$BI$1:$CP$1,BI69:CP69)),\"\")","v":""},null,{"$f":"IF(AND($CQ$43>20,$BV$42=\"X\"),CQ69,IF(CQ69=0,\"\",CQ69))","v":""}]
[null,3,"G3",{"$f":"'1. Runde Gruppen'!D29","v":""},{"$f":"AJ71+AJ73+AJ76+AJ75","v":0},{"$f":"AI71+AI73+AH76+AH75","v":0},{"$f":"AH71+AH73+AI76+AI75","v":0},{"$f":"AG71+AG73+AF76+AF75","v":0},{"$f":"AF71+AF73+AG76+AG75","v":0},{"$f":"AK71+AK73+AK76+AK75","v":0},null,null,{"$f":"IF(D70=\"X\",-200000,IF(D70=\"Y\",-200000,IF(D70=\"Z\",-200000,IF(D70=\"\",-200000,IF(D70=\"Z Freilos\",-200000,IF(D70=\"\",(-90000),(F70*10000)+(H70*1000)+(J70*10)+E70-(G70*10000)-(I70*1000)+O70))))))","v":-200000},{"$f":"IF(E70=0,\"\",RANK(M70,M68:M72))","v":""},{"$f":"'1. Runde Gruppen'!O29","v":0},{"$f":"IF(D70=\"\",\"\",D70)","v":""},{"$f":"IF(V70=\"\",\"\",3)","v":""},23,"","G",{"$f":"C68","v":"G1"},{"$f":"IF(X70=\"\",\"\",D68)","v":""},{"$f":"C72","v":"G5"},{"$f":"D72","v":""},"","","",{"$f":"Matches!O70","v":0},{"$f":"Matches!P70","v":0},null,null,0,0,0,0,{"$f":"IF(AF70+AG70>=1,1,0)","v":0},0,null,null,null,null,null,null,null,null,null,null,null,null,null,null,null,null,null,null,null,null,"",null,"","F2",null,null,null,null,null,null,null,null,null,null,"F2","F2","F2","F2","F2","F2","F2","F2","F2","F2","F2","F2","F2","F2","F2","F2","F2","F2","F2","F2","F2","F2","F2",{"$f":"IFERROR(IF(AND($BV$42=\"X\",$CQ$43<21),\"\",LOOKUP($CQ$1,$BI$1:$CP$1,BI70:CP70)),\"\")","v":""},null,{"$f":"IF(AND($CQ$43>20,$BV$42=\"X\"),CQ70,IF(CQ70=0,\"\",CQ70))","v":""}]
[null,{"$f":"IF(D71=\"\",\"\",4)","v":""},"G4",{"$f":"'1. Runde Gruppen'!D30","v":""},{"$f":"AJ69+AJ72+AJ74+AJ76","v":0},{"$f":"AI69+AH72+AI74+AI76","v":0},{"$f":"AH69+AH74+AH76+AI72","v":0},{"$f":"AG69+AF72+AG74+AG76","v":0},{"$f":"AF69+AG72+AF74+AF76","v":0},{"$f":"AK69+AK74+AK76+AK72","v":0},null,null,{"$f":"IF(D71=\"X\",-200000,IF(D71=\"Y\",-200000,IF(D71=\"Z\",-200000,IF(D71=\"\",-200000,IF(D71=\"Z Freilos\",-200000,IF(D71=\"\",(-90000),(F71*10000)+(H71*1000)+(J71*10)+E71-(G71*10000)-(I71*1000)+O71))))))","v":-200000},{"$f":"IF(E71=0,\"\",RANK(M71,M68:M72))","v":""},{"$f":"'1. Runde Gruppen'!O30","v":0},{"$f":"IF(D71=\"\",\"\",D71)","v":""},{"$f":"IF(V71=\"\",\"\",4)","v":""},31,"","G",{"$f":"C69","v":"G2"},{"$f":"D68","v":""},{"$f":"C70","v":"G3"},{"$f":"D70","v":""},"","","",{"$f":"Matches!O71","v":0},{"$f":"Matches!P71","v":0},null,null,0,0,0,0,0,0,null,null,null,null,null,null,null,null,null,null,null,null,null,null,null,null,null,null,null,null,"",null,"","F3",null,null,null,null,null,null,null,null,null,null,"F3","F3","F3","F3","F3","F3","F3","F3","F3","F3","F3","F3","F3","F3","F3","F3","F3","F3","F3","F3","F3","F3","F3",{"$f":"IFERROR(IF(AND($BV$42=\"X\",$CQ$43<21),\"\",LOOKUP($CQ$1,$BI$1:$CP$1,BI71:CP71)),\"\")","v":""},null,{"$f":"IF(AND($CQ$43>20,$BV$42=\"X\"),CQ71,IF(CQ71=0,\"\",CQ71))","v":""}]
[null,{"$f":"IF(D72=\"\",\"\",5)","v":""},"G5",{"$f":"'1. Runde Gruppen'!D31","v":""},{"$f":"AJ70+AJ72+AJ75+AJ77","v":0},{"$f":"AI70+AI72+AI75+AI77","v":0},{"$f":"AH70+AH72+AH75+AH77","v":0},{"$f":"AG70+AG72+AG75+AG77","v":0},{"$f":"AF70+AF72+AF75+AF77","v":0},{"$f":"AK70+AK72+AK75+AK77","v":0},null,null,{"$f":"IF(D72=\"X\",-200000,IF(D72=\"Y\",-200000,IF(D72=\"Z\",-200000,IF(D72=\"\",-200000,IF(D72=\"Z Freilos\",-200000,IF(D72=\"\",(-90000),(F72*10000)+(H72*1000)+(J72*10)+E72-(G72*10000)-(I72*1000)+O72))))))","v":-200000},{"$f":"IF(E72=0,\"\",RANK(M72,M68:M72))","v":""},{"$f":"'1. Runde Gruppen'!O31","v":0},{"$f":"IF(D72=\"\",\"\",D72)","v":""},{"$f":"IF(V72=\"\",\"\",5)","v":""},39,"","G",{"$f":"C71","v":"G4"},{"$f":"IF(X72=\"\",\"\",D71)","v":""},{"$f":"C72","v":"G5"},{"$f":"D72","v":""},"","","",{"$f":"Matches!O72","v":0},{"$f":"Matches!P72","v":0},null,null,0,0,0,0,0,0,null,null,null,null,null,null,null,null,null,null,null,null,null,null,null,null,null,null,null,null,"",null,"","F4",null,null,null,null,null,null,null,null,null,null,null,null,null,null,null,null,{"$f":"IF($BV$42=\"X\",\"\",\"F4\")","v":""},null,null,null,null,null,"F4","F4","F4","F4","F4","F4","F4","F4","F4","F4","F4",{"$f":"IFERROR(LOOKUP($CQ$1,$BI$1:$CP$1,BI72:CP72),\"\")","v":"F4"},null,{"$f":"IF(AND(CQ43=24,$BV$42=\"\"),\"F4\",IF(CQ72=0,\"\",CQ72))","v":"F4"}]
[null,null,null,null,null,null,null,null,null,null,null,null,null,null,null,null,{"$f":"IF(V73=\"\",\"\",6)","v":""},{"$f":"IF(B71=4,77,47)","v":47},"","G",{"$f":"C68","v":"G1"},{"$f":"D69","v":""},{"$f":"C70","v":"G3"},"","","","",{"$f":"Matches!O73","v":0},{"$f":"Matches!P73","v":0},null,null,0,0,0,0,0,0,null,null,null,null,null,null,null,null,null,null,null,null,null,null,null,null,null,null,null,null,"",null,"","F5",null,null,null,null,null,null,null,null,null,null,null,null,null,null,null,null,null,null,null,null,null,null,null,null,null,null,null,null,null,null,"F5","F5","F5","F5",null,"F5"]
[null,null,null,null,null,null,null,null,null,null,null,null,null,null,null,null,{"$f":"IF(V74=\"\",\"\",7)","v":""},55,"","G",{"$f":"C69","v":"G2"},{"$f":"IF(X74=\"\",\"\",D68)","v":""},"G4","","","","",{"$f":"Matches!O74","v":0},{"$f":"Matches!P74","v":0},null,null,0,0,0,0,0,0,null,null,null,null,null,null,null,null,null,null,null,null,null,null,null,null,null,null,null,null,"",null,"","G1",null,null,null,null,null,null,null,null,null,null,null,null,null,null,null,null,{"$f":"IF($BV$42=\"X\",\"G1\",\"\")","v":"G1"},"G1","G1","G1","G1","G1","G1","G1","G1","G1","G1","G1","G1","G1","G1","G1","G1","G1",null,"G1"]
[null,null,null,null,null,null,null,null,null,null,null,null,null,null,null,null,{"$f":"IF(V75=\"\",\"\",8)","v":""},63,"","G",{"$f":"C70","v":"G3"},{"$f":"IF(X75=\"\",\"\",D70)","v":""},"G5","","","","",{"$f":"Matches!O75","v":0},{"$f":"Matches!P75","v":0},null,null,0,0,0,0,0,0,null,null,null,null,null,null,null,null,null,null,null,null,null,null,null,null,null,null,null,null,"",null,"","G2",null,null,null,null,null,null,null,null,null,null,null,null,null,null,null,null,{"$f":"IF($BV$42=\"X\",\"G2\",\"\")","v":"G2"},"G2","G2","G2","G2","G2","G2","G2","G2","G2","G2","G2","G2","G2","G2","G2","G2","G2",null,"G2"]
[null,null,null,null,null,null,null,null,null,null,null,null,null,null,null,null,{"$f":"IF(V76=\"\",\"\",9)","v":""},{"$f":"IF(B71=4,15,71)","v":71},"","G",{"$f":"C68","v":"G1"},{"$f":"IF(X76=\"\",\"\",D70)","v":""},{"$f":"C71","v":"G4"},{"$f":"D71","v":""},"","","",{"$f":"Matches!O76","v":0},{"$f":"Matches!P76","v":0},null,null,0,0,0,0,0,0,null,null,null,null,null,null,null,null,null,null,null,null,null,null,null,null,null,null,null,null,"",null,"","G3",null,null,null,null,null,null,null,null,null,null,null,null,null,null,null,null,{"$f":"IF($BV$42=\"X\",\"G3\",\"\")","v":"G3"},"G3","G3","G3","G3","G3","G3","G3","G3","G3","G3","G3","G3","G3","G3","G3","G3","G3",null,"G3"]
[null,null,null,null,null,null,null,null,null,null,null,null,null,null,null,null,{"$f":"IF(V77=\"\",\"\",10)","v":""},79,"","G",{"$f":"C69","v":"G2"},{"$f":"IF(X77=\"\",\"\",D69)","v":""},{"$f":"C72","v":"G5"},{"$f":"D72","v":""},"","","",{"$f":"Matches!O77","v":0},{"$f":"Matches!P77","v":0},null,null,{"$f":"VLOOKUP(S77,$Y$2:$AC$88,4,FALSE)","v":0},{"$f":"VLOOKUP(S77,$Y$2:$AC$88,5,FALSE)","v":0},0,0,0,0,null,null,null,null,null,null,null,null,null,null,null,null,null,null,null,null,null,null,null,null,"",null,"","G4",null,null,null,null,null,null,null,null,null,null,null,null,null,null,null,null,null,null,null,null,null,null,null,"G4","G4","G4","G4","G4","G4","G4","G4","G4","G4","G4",null,"G4"]
["H",null,null,"Spieler","M","W","L","F+","F-","U",null,null,"Rang","Rang","P+",null,null,null,"",null,null,null,null,null,"","","",{"$f":"Matches!O78","v":0},{"$f":"Matches!P78","v":0},null,null,null,null,null,null,null,null,null,null,null,null,null,null,null,null,null,null,null,null,null,null,null,null,null,null,null,null,"",null,"","G5",null,null,null,null,null,null,null,null,null,null,null,null,null,null,null,null,null,null,null,null,null,null,null,null,null,null,null,null,null,null,null,"G5","G5","G5",null,"G5"]
[null,1,"H1",{"$f":"'1. Runde Gruppen'!T27","v":""},{"$f":"AJ79+AJ82+AJ85+AJ81","v":0},{"$f":"AH79+AH82+AH85+AH81","v":0},{"$f":"AI79+AI82+AI85+AI81","v":0},{"$f":"AF79+AF82+AF85+AF81","v":0},{"$f":"AG79+AG82+AG85+AG81","v":0},{"$f":"AK79+AK82+AK85+AK81","v":0},null,null,{"$f":"IF(D79=\"X\",-200000,IF(D79=\"Y\",-200000,IF(D79=\"Z\",-200000,IF(D79=\"\",-200000,IF(D79=\"Z Freilos\",-200000,IF(D79=\"\",(-90000),(F79*10000)+(H79*1000)+(J79*10)+E79-(G79*10000)-(I79*1000)+O79))))))","v":-200000},{"$f":"IF(E79=0,\"\",RANK(M79,M79:M83))","v":""},{"$f":"'1. Runde Gruppen'!AE27","v":0},{"$f":"IF(D79=\"\",\"\",D79)","v":""},{"$f":"IF(V79=\"\",\"\",1)","v":""},8,"","H",{"$f":"C79","v":"H1"},{"$f":"D79","v":""},{"$f":"C80","v":"H2"},{"$f":"D80","v":""},"","","",{"$f":"Matches!O79","v":0},{"$f":"Matches!P79","v":0},null,null,{"$f":"VLOOKUP(S79,$Y$2:$AC$88,4,FALSE)","v":0},{"$f":"VLOOKUP(S79,$Y$2:$AC$88,5,FALSE)","v":0},{"$f":"IF(AF79>AG79,1,0)","v":0},{"$f":"IF(AG79>AF79,1,0)","v":0},{"$f":"IF(AF79+AG79>=1,1,0)","v":0},{"$f":"IF(AND(AF79+AG79>1,AF79=AG79),1,0)","v":0},null,null,null,null,null,null,null,null,null,null,null,null,null,null,null,null,null,null,null,null,"",null,"","H1",null,null,null,null,null,null,null,null,null,null,null,null,null,null,null,null,{"$f":"IF($BV$42=\"X\",\"H1\",\"\")","v":"H1"},"H1","H1","H1","H1","H1","H1","H1","H1","H1","H1","H1","H1","H1","H1","H1","H1","H1",null,"H1"]
[null,2,"H2",{"$f":"'1. Runde Gruppen'!T28","v":""},{"$f":"AJ79+AJ84+AJ80+AJ88","v":0},{"$f":"AI79+AH80+AH84+AH88","v":0},{"$f":"AH79+AI84+AI80+AI88","v":0},{"$f":"AG79+AF88+AF84+AF80","v":0},{"$f":"AF79+AG80+AG84+AG88","v":0},{"$f":"AK79+AK84+AK80+AK88","v":0},null,null,{"$f":"IF(D80=\"X\",-200000,IF(D80=\"Y\",-200000,IF(D80=\"Z\",-200000,IF(D80=\"\",-200000,IF(D80=\"Z Freilos\",-200000,IF(D80=\"\",(-90000),(F80*10000)+(H80*1000)+(J80*10)+E80-(G80*10000)-(I80*1000)+O80))))))","v":-200000},{"$f":"IF(E80=0,\"\",RANK(M80,M79:M83))","v":""},{"$f":"'1. Runde Gruppen'!AE28","v":0},{"$f":"IF(D80=\"\",\"\",D80)","v":""},{"$f":"IF(V80=\"\",\"\",2)","v":""},{"$f":"IF(B82=4,48,16)","v":16},"","H",{"$f":"C81","v":"H3"},{"$f":"IF(X80=\"\",\"\",D80)","v":""},{"$f":"C82","v":"H4"},{"$f":"D82","v":""},"","","",{"$f":"Matches!O80","v":0},{"$f":"Matches!P80","v":0},null,null,{"$f":"VLOOKUP(S80,$Y$2:$AC$88,4,FALSE)","v":0},{"$f":"VLOOKUP(S80,$Y$2:$AC$88,5,FALSE)","v":0},0,0,{"$f":"IF(AF80+AG80>=1,1,0)","v":0},{"$f":"IF(AND(AF80+AG80>1,AF80=AG80),1,0)","v":0},null,null,null,null,null,null,null,null,null,null,null,null,null,null,null,null,null,null,null,null,"",null,"","H2",null,null,null,null,null,null,null,null,null,null,null,null,null,null,null,null,{"$f":"IF($BV$42=\"X\",\"H2\",\"\")","v":"H2"},"H2","H2","H2","H2","H2","H2","H2","H2","H2","H2","H2","H2","H2","H2","H2","H2","H2",null,"H2"]
[null,3,"H3",{"$f":"'1. Runde Gruppen'!T29","v":""},{"$f":"AJ82+AJ84+AJ87+AJ86","v":0},{"$f":"AI82+AI84+AH87+AH86","v":0},{"$f":"AH82+AH84+AI87+AI86","v":0},{"$f":"AG82+AG84+AF87+AF86","v":0},{"$f":"AF82+AF84+AG87+AG86","v":0},{"$f":"AK82+AK84+AK87+AK86","v":0},null,null,{"$f":"IF(D81=\"X\",-200000,IF(D81=\"Y\",-200000,IF(D81=\"Z\",-200000,IF(D81=\"\",-200000,IF(D81=\"Z Freilos\",-200000,IF(D81=\"\",(-90000),(F81*10000)+(H81*1000)+(J81*10)+E81-(G81*10000)-(I81*1000)+O81))))))","v":-200000},{"$f":"IF(E81=0,\"\",RANK(M81,M79:M83))","v":""},{"$f":"'1. Runde Gruppen'!AE29","v":0},{"$f":"IF(D81=\"\",\"\",D81)","v":""},{"$f":"IF(V81=\"\",\"\",3)","v":""},24,"","H",{"$f":"C79","v":"H1"},{"$f":"IF(X81=\"\",\"\",D79)","v":""},{"$f":"C83","v":"H5"},{"$f":"D83","v":""},"","","",{"$f":"Matches!O81","v":0},{"$f":"Matches!P81","v":0},null,null,0,0,0,0,{"$f":"IF(AF81+AG81>=1,1,0)","v":0},0,null,null,null,null,null,null,null,null,null,null,null,null,null,null,null,null,null,null,null,null,"",null,"","H3",null,null,null,null,null,null,null,null,null,null,null,null,null,null,null,null,{"$f":"IF($BV$42=\"X\",\"H3\",\"\")","v":"H3"},"H3","H3","H3","H3","H3","H3","H3","H3","H3","H3","H3","H3","H3","H3","H3","H3","H3",null,"H3"]
[null,{"$f":"IF(D82=\"\",\"\",4)","v":""},"H4",{"$f":"'1. Runde Gruppen'!T30","v":""},{"$f":"AJ80+AJ83+AJ85+AJ87","v":0},{"$f":"AI80+AH83+AI85+AI87","v":0},{"$f":"AH80+AH85+AH87+AI83","v":0},{"$f":"AG80+AF83+AG85+AG87","v":0},{"$f":"AF80+AG83+AF85+AF87","v":0},{"$f":"AK80+AK85+AK87+AK83","v":0},null,null,{"$f":"IF(D82=\"X\",-200000,IF(D82=\"Y\",-200000,IF(D82=\"Z\",-200000,IF(D82=\"\",-200000,IF(D82=\"Z Freilos\",-200000,IF(D82=\"\",(-90000),(F82*10000)+(H82*1000)+(J82*10)+E82-(G82*10000)-(I82*1000)+O82))))))","v":-200000},{"$f":"IF(E82=0,\"\",RANK(M82,M79:M83))","v":""},{"$f":"'1. Runde Gruppen'!AE30","v":0},{"$f":"IF(D82=\"\",\"\",D82)","v":""},{"$f":"IF(V82=\"\",\"\",4)","v":""},32,"","H",{"$f":"C80","v":"H2"},{"$f":"D79","v":""},{"$f":"C81","v":"H3"},{"$f":"D81","v":""},"","","",null,null,null,null,0,0,0,0,0,0,null,null,null,null,null,null,null,null,null,null,null,null,null,null,null,null,null,null,null,null,null,null,"","H4",null,null,null,null,null,null,null,null,null,null,null,null,null,null,null,null,null,null,null,null,null,null,null,null,"H4","H4","H4","H4","H4","H4","H4","H4","H4","H4",null,"H4"]
[null,{"$f":"IF(D83=\"\",\"\",5)","v":""},"H5",{"$f":"'1. Runde Gruppen'!T31","v":""},{"$f":"AJ81+AJ83+AJ86+AJ88","v":0},{"$f":"AI81+AI83+AI86+AI88","v":0},{"$f":"AH81+AH83+AH86+AH88","v":0},{"$f":"AG81+AG83+AG86+AG88","v":0},{"$f":"AF81+AF83+AF86+AF88","v":0},{"$f":"AK81+AK83+AK86+AK88","v":0},null,null,{"$f":"IF(D83=\"X\",-200000,IF(D83=\"Y\",-200000,IF(D83=\"Z\",-200000,IF(D83=\"\",-200000,IF(D83=\"Z Freilos\",-200000,IF(D83=\"\",(-90000),(F83*10000)+(H83*1000)+(J83*10)+E83-(G83*10000)-(I83*1000)+O83))))))","v":-200000},{"$f":"IF(E83=0,\"\",RANK(M83,M79:M83))","v":""},{"$f":"'1. Runde Gruppen'!AE31","v":0},{"$f":"IF(D83=\"\",\"\",D83)","v":""},{"$f":"IF(V83=\"\",\"\",5)","v":""},40,"","H",{"$f":"C82","v":"H4"},{"$f":"IF(X83=\"\",\"\",D82)","v":""},{"$f":"C83","v":"H5"},{"$f":"D83","v":""},"","","",null,null,null,null,0,0,0,0,0,0,null,null,null,null,null,null,null,null,null,null,null,null,null,null,null,null,null,null,null,null,null,null,"","H5",null,null,null,null,null,null,null,null,null,null,null,null,null,null,null,null,null,null,null,null,null,null,null,null,null,null,null,null,null,null,null,null,"H5","H5",null,"H5"]
[null,null,null,null,null,null,null,null,null,null,null,null,null,null,null,null,{"$f":"IF(V84=\"\",\"\",6)","v":""},{"$f":"IF(B82=4,78,48)","v":48},"","H",{"$f":"C79","v":"H1"},{"$f":"D80","v":""},{"$f":"C81","v":"H3"},"","","","",null,null,null,null,0,0,0,0,0,0,null,null,null,null,null,null,null,null,null,null,null,null,null,null,null,null,null,null,null,null,null,null,""]
[null,null,null,null,null,null,null,null,null,null,null,null,null,null,null,null,{"$f":"IF(V85=\"\",\"\",7)","v":""},56,"","H",{"$f":"C80","v":"H2"},{"$f":"IF(X85=\"\",\"\",D79)","v":""},"H4","","","","",null,null,null,null,0,0,0,0,0,0,null,null,null,null,null,null,null,null,null,null,null,null,null,null,null,null,null,null,null,null,null,null,""]
[null,null,null,null,null,null,null,null,null,null,null,null,null,null,null,null,{"$f":"IF(V86=\"\",\"\",8)","v":""},64,"","H",{"$f":"C81","v":"H3"},{"$f":"IF(X86=\"\",\"\",D81)","v":""},"H5","","","","",null,null,null,null,0,0,0,0,0,0,null,null,null,null,null,null,null,null,null,null,null,null,null,null,null,null,null,null,null,null,null,null,""]
[null,null,null,null,null,null,null,null,null,null,null,null,{"$f":"BH1","v":0},null,null,null,{"$f":"IF(V87=\"\",\"\",9)","v":""},{"$f":"IF(B82=4,16,72)","v":72},"","H",{"$f":"C79","v":"H1"},{"$f":"IF(X87=\"\",\"\",D81)","v":""},{"$f":"C82","v":"H4"},{"$f":"D82","v":""},"","","",null,null,null,null,0,0,0,0,0,0,null,null,null,null,null,null,null,null,null,null,null,null,null,null,null,null,null,null,null,null,null,null,""]
[null,null,null,null,null,null,null,null,null,null,null,null,{"$f":"Finals!A6","v":""},null,null,null,{"$f":"IF(V88=\"\",\"\",10)","v":""},80,"","H",{"$f":"C80","v":"H2"},{"$f":"IF(X88=\"\",\"\",D80)","v":""},{"$f":"C83","v":"H5"},{"$f":"D83","v":""},"","","",null,null,null,null,{"$f":"VLOOKUP(S88,$Y$2:$AC$88,4,FALSE)","v":0},{"$f":"VLOOKUP(S88,$Y$2:$AC$88,5,FALSE)","v":0},0,0,0,0,null,null,null,null,null,null,null,null,null,null,null,null,null,null,null,null,null,null,null,null,null,null,"","2. Gruppenrunde",null,null,null,null,null,null,null,null,null,null,null,null,{"$f":"BV42","v":"X"}]
[null,null,null,null,"F+","F+","F+","F+",null,null,null,null,{"$f":"Finals!A2","v":"X"},{"$f":"IF(AND(M87>23,M89=\"X\"),\"AF\",\"\")","v":""},null,{"$f":"IF(AND(M88=4,M89=\"\"),\"\",IF(AND(M88=5,M89=\"X\"),\"\",\"VF\"))","v":"VF"},null,null,null,{"$f":"IF(AND(M88=4,M89=\"\"),\"R2\",IF(AND(M88=5,M89=\"X\"),\"R2\",\"\"))","v":""},null,null,null,"AF - VF - R2",null,null,null,null,null,null,null,null,null,null,null,null,null,null,null,null,null,null,null,null,null,null,null,null,null,null,null,null,null,null,null,null,null,null,null,null,null,null,null,null,11,null,null,null,null,null,17,18,19,20,21,22,23,24,null,null,null,null,null,null,null,null,null,null,null,null,null,null,null,null,{"$f":"CQ43","v":0},null,null,null,"Achtelfinale",null,"Viertelfinale"]
[null,1,"A1",{"$f":"VLOOKUP(1,$N$2:$P$6,3,FALSE)","v":{"$error":"#N/A"}},{"$f":"IFERROR(VLOOKUP(D90,Finals!$B$4:$C$26,2,FALSE),\"\")","v":""},{"$f":"IFERROR(VLOOKUP(D90,Finals!$J$6:$K$24,2,FALSE),\"\")","v":""},{"$f":"IFERROR(VLOOKUP(D90,Finals!$Q$10:$R$20,2,FALSE),\"\")","v":""},{"$f":"IFERROR(VLOOKUP(D90,Finals!$X$23:$Y$24,2,FALSE),\"\")","v":""},{"$f":"IFERROR(VLOOKUP(D90,Finals!$X$14:$Y$15,2,FALSE),\"\")","v":""},null,null,null,{"$f":"IFERROR(IF(AND($M$87=24,$M$89=\"\"),\"\",IF($M$87<24,\"\",D90)),\"\")","v":""},{"$f":"IFERROR(IF(AND($M$88=6,$M$89=\"X\"),D90,\"\"),\"\")","v":""},null,{"$f":"IF(M87=11,D90,IF(AND($M$88=3,$M$89=\"X\"),D90,IF(AND($M$88=4,$M$89=\"X\"),D90,\"\")))","v":""},null,null,{"$f":"IF(T90=\"\",\"\",1)","v":""},{"$f":"IF(AND($M$88=4,$M$89=\"\"),VLOOKUP(1,'2. Runde Gruppen'!$N$3:$P$5,3,FALSE),IF(AND($M$88=5,$M$89=\"X\"),VLOOKUP(1,'2. Runde Gruppen'!$N$3:$P$5,3,FALSE),\"\"))","v":""},null,null,null,{"$f":"IFERROR(IF($N$89=\"AF\",N90,IF($P$89=\"VF\",P90,IF($T$89=\"R2\",T90,\"\"))),\"\")","v":""},null,null,null,null,null,null,null,null,null,null,"A1",null,null,null,null,null,null,null,null,null,null,null,null,null,null,null,null,null,null,null,null,null,null,null,null,{"$f":"C90","v":"A1"},{"$f":"D90","v":{"$error":"#N/A"}},null,null,null,{"$f":"BI90","v":{"$error":"#N/A"}},null,null,null,null,null,{"$f":"$BI$90","v":{"$error":"#N/A"}},{"$f":"$BI$90","v":{"$error":"#N/A"}},{"$error":"#N/A"},{"$error":"#N/A"},{"$error":"#N/A"},{"$error":"#N/A"},{"$error":"#N/A"},{"$error":"#N/A"},null,null,null,null,null,null,null,null,null,null,null,null,null,null,null,"A1",{"$f":"IFERROR(IF(AND($CQ$89>16,$CQ$89<=24),LOOKUP($CQ$89,$BS$89:$BZ$89,BS90:BZ90),\"\"),\"\")","v":""},null,null,1,null,1]
[null,1,"B1",{"$f":"VLOOKUP(1,$N$13:$P$17,3,FALSE)","v":{"$error":"#N/A"}},{"$f":"IFERROR(VLOOKUP(D91,Finals!$B$4:$C$26,2,FALSE),\"\")","v":""},{"$f":"IFERROR(VLOOKUP(D91,Finals!$J$6:$K$24,2,FALSE),\"\")","v":""},{"$f":"IFERROR(VLOOKUP(D91,Finals!$Q$10:$R$20,2,FALSE),\"\")","v":""},{"$f":"IFERROR(VLOOKUP(D91,Finals!$X$23:$Y$24,2,FALSE),\"\")","v":""},{"$f":"IFERROR(VLOOKUP(D91,Finals!$X$14:$Y$15,2,FALSE),\"\")","v":""},null,null,null,"","",null,{"$f":"IF(M87=11,D91,IF(AND($M$88=3,$M$89=\"X\"),D91,IF(AND($M$88=4,$M$89=\"X\"),D91,\"\")))","v":""},null,null,{"$f":"IF(T91=\"\",\"\",2)","v":""},{"$f":"IF(AND($M$88=4,$M$89=\"\"),VLOOKUP(1,'2. Runde Gruppen'!$N$8:$P$10,3,FALSE),IF(AND($M$88=5,$M$89=\"X\"),VLOOKUP(1,'2. Runde Gruppen'!$N$8:$P$10,3,FALSE),\"\"))","v":""},null,null,null,{"$f":"IFERROR(IF($N$89=\"AF\",N91,IF($P$89=\"VF\",P91,IF($T$89=\"R2\",T91,\"\"))),\"\")","v":""},null,null,null,null,null,null,null,null,null,null,"A2",null,null,null,null,null,null,null,null,null,null,null,null,null,null,null,null,null,null,null,null,null,null,null,null,"B1",{"$f":"D91","v":{"$error":"#N/A"}},null,null,null,{"$f":"BI107","v":{"$error":"#N/A"}},null,null,null,null,null,{"$f":"$BI$94","v":{"$error":"#N/A"}},{"$f":"$BI$94","v":{"$error":"#N/A"}},{"$error":"#N/A"},{"$error":"#N/A"},{"$error":"#N/A"},{"$error":"#N/A"},{"$error":"#N/A"},{"$error":"#N/A"},null,null,null,null,null,null,null,null,null,null,null,null,null,null,null,"A2",{"$f":"IFERROR(IF(AND($CQ$89>16,$CQ$89<=24),LOOKUP($CQ$89,$BS$89:$BZ$89,BS91:BZ91),\"\"),\"\")","v":""},null,null,2,null,2]
[null,1,"C1",{"$f":"VLOOKUP(1,$N$24:$P$28,3,FALSE)","v":{"$error":"#N/A"}},{"$f":"IFERROR(VLOOKUP(D92,Finals!$B$4:$C$26,2,FALSE),\"\")","v":""},{"$f":"IFERROR(VLOOKUP(D92,Finals!$J$6:$K$24,2,FALSE),\"\")","v":""},{"$f":"IFERROR(VLOOKUP(D92,Finals!$Q$10:$R$20,2,FALSE),\"\")","v":""},{"$f":"IFERROR(VLOOKUP(D92,Finals!$X$23:$Y$24,2,FALSE),\"\")","v":""},{"$f":"IFERROR(VLOOKUP(D92,Finals!$X$14:$Y$15,2,FALSE),\"\")","v":""},null,null,null,"","",null,{"$f":"IF(M87=11,D92,IF(AND($M$88=3,$M$89=\"X\"),D92,IF(AND($M$88=4,$M$89=\"X\"),D92,\"\")))","v":""},null,null,{"$f":"IF(T92=\"\",\"\",3)","v":""},{"$f":"IF(AND($M$88=4,$M$89=\"\"),VLOOKUP(1,'2. Runde Gruppen'!$N$13:$P$15,3,FALSE),IF(AND($M$88=5,$M$89=\"X\"),VLOOKUP(1,'2. Runde Gruppen'!$N$13:$P$15,3,FALSE),\"\"))","v":""},null,null,null,"",null,null,null,null,null,null,null,null,null,null,"A3",null,null,null,null,null,null,null,null,null,null,null,null,null,null,null,null,null,null,null,null,null,null,null,null,"C1",{"$error":"#N/A"},null,null,null,null,null,null,null,null,null,{"$f":"BI107","v":{"$error":"#N/A"}},{"$f":"$BI$101","v":{"$error":"#N/A"}},{"$error":"#N/A"},{"$error":"#N/A"},{"$error":"#N/A"},{"$error":"#N/A"},{"$error":"#N/A"},{"$error":"#N/A"},null,null,null,null,null,null,null,null,null,null,null,null,null,null,null,"A3",{"$f":"IFERROR(IF(AND($CQ$89>16,$CQ$89<=24),LOOKUP($CQ$89,$BS$89:$BZ$89,BS92:BZ92),\"\"),\"\")","v":""},null,null,3,null,3]
[null,1,"D1",{"$f":"VLOOKUP(1,$N$35:$P$39,3,FALSE)","v":{"$error":"#N/A"}},{"$f":"IFERROR(VLOOKUP(D93,Finals!$B$4:$C$26,2,FALSE),\"\")","v":""},{"$f":"IFERROR(VLOOKUP(D93,Finals!$J$6:$K$24,2,FALSE),\"\")","v":""},{"$f":"IFERROR(VLOOKUP(D93,Finals!$Q$10:$R$20,2,FALSE),\"\")","v":""},{"$f":"IFERROR(VLOOKUP(D93,Finals!$X$23:$Y$24,2,FALSE),\"\")","v":""},{"$f":"IFERROR(VLOOKUP(D93,Finals!$X$14:$Y$15,2,FALSE),\"\")","v":""},null,null,null,"","",null,{"$f":"IF(M87=11,D98,IF(AND($M$88=3,$M$89=\"X\"),D93,IF(AND($M$88=4,$M$89=\"X\"),D93,\"\")))","v":""},null,null,{"$f":"IF(T93=\"\",\"\",4)","v":""},{"$f":"IF(AND($M$88=4,$M$89=\"\"),VLOOKUP(1,'2. Runde Gruppen'!$N$18:$P$20,3,FALSE),IF(AND($M$88=5,$M$89=\"X\"),VLOOKUP(1,'2. Runde Gruppen'!$N$18:$P$20,3,FALSE),\"\"))","v":""},null,null,null,"",null,null,null,null,null,null,null,null,null,null,"B1",null,null,null,null,null,null,null,null,null,null,null,null,null,null,null,null,null,null,null,null,null,null,null,null,"D1",{"$error":"#N/A"},null,null,null,{"$f":"BI91","v":{"$error":"#N/A"}},null,null,null,null,null,{"$f":"$BI$91","v":{"$error":"#N/A"}},{"$f":"$BI$91","v":{"$error":"#N/A"}},{"$error":"#N/A"},{"$error":"#N/A"},{"$error":"#N/A"},{"$error":"#N/A"},{"$error":"#N/A"},{"$error":"#N/A"},null,null,null,null,null,null,null,null,null,null,null,null,null,null,null,"B1",{"$f":"IFERROR(IF(AND($CQ$89>16,$CQ$89<=24),LOOKUP($CQ$89,$BS$89:$BZ$89,BS93:BZ93),\"\"),\"\")","v":""},null,null,4,null,4]
[null,1,"E1",{"$f":"VLOOKUP(1,$N$46:$P$50,3,FALSE)","v":{"$error":"#N/A"}},{"$f":"IFERROR(VLOOKUP(D94,Finals!$B$4:$C$26,2,FALSE),\"\")","v":""},{"$f":"IFERROR(VLOOKUP(D94,Finals!$J$6:$K$24,2,FALSE),\"\")","v":""},{"$f":"IFERROR(VLOOKUP(D94,Finals!$Q$10:$R$20,2,FALSE),\"\")","v":""},{"$f":"IFERROR(VLOOKUP(D94,Finals!$X$23:$Y$24,2,FALSE),\"\")","v":""},{"$f":"IFERROR(VLOOKUP(D94,Finals!$X$14:$Y$15,2,FALSE),\"\")","v":""},null,null,null,"","",null,{"$f":"IFERROR(IF(M87=11,D99,IF(AND($M$88=3,$M$89=\"X\"),VLOOKUP(SMALL($J$98:$J$101,1),$J$98:$K$101,2,0),IF(AND($M$88=4,$M$89=\"X\"),VLOOKUP(SMALL($J$100:$J$101,1),$J$100:$K$101,2,0),IF(AND($M$88=5,$M$89=\"X\"),VLOOKUP(SMALL($J$98:$J$101,1),$J$98:$K$101,2,0),\"\")))),\"\")","v":""},null,null,{"$f":"IF(T94=\"\",\"\",1)","v":""},{"$f":"IF(AND($M$88=4,$M$89=\"\"),VLOOKUP(2,'2. Runde Gruppen'!$N$3:$P$5,3,FALSE),IF(AND($M$88=5,$M$89=\"X\"),VLOOKUP(2,'2. Runde Gruppen'!$N$3:$P$5,3,FALSE),\"\"))","v":""},null,null,null,{"$f":"IFERROR(IF($N$89=\"AF\",N94,IF($P$89=\"VF\",P94,IF($T$89=\"R2\",T94,\"\"))),\"\")","v":""},null,null,null,null,null,null,null,null,null,null,"B2",null,null,null,null,null,null,null,null,null,null,null,null,null,null,null,null,null,null,null,null,null,null,null,null,"E1",{"$error":"#N/A"},null,null,null,{"$f":"BI106","v":{"$error":"#N/A"}},null,null,null,null,null,{"$f":"BI100","v":{"$error":"#N/A"}},{"$f":"$BI$100","v":{"$error":"#N/A"}},{"$error":"#N/A"},{"$error":"#N/A"},{"$error":"#N/A"},{"$error":"#N/A"},{"$error":"#N/A"},{"$error":"#N/A"},null,null,null,null,null,null,null,null,null,null,null,null,null,null,null,"B2","",null,null,5,null,5]
[null,1,"F1",{"$f":"VLOOKUP(1,$N$57:$P$61,3,FALSE)","v":{"$error":"#N/A"}},{"$f":"IFERROR(VLOOKUP(D95,Finals!$B$4:$C$26,2,FALSE),\"\")","v":""},{"$f":"IFERROR(VLOOKUP(D95,Finals!$J$6:$K$24,2,FALSE),\"\")","v":""},{"$f":"IFERROR(VLOOKUP(D95,Finals!$Q$10:$R$20,2,FALSE),\"\")","v":""},{"$f":"IFERROR(VLOOKUP(D95,Finals!$X$23:$Y$24,2,FALSE),\"\")","v":""},{"$f":"IFERROR(VLOOKUP(D95,Finals!$X$14:$Y$15,2,FALSE),\"\")","v":""},null,null,null,"","",null,{"$f":"IFERROR(IF(M87=11,D100,IF(AND($M$88=3,$M$89=\"X\"),VLOOKUP(SMALL($J$98:$J$101,2),$J$98:$K$101,2,0),IF(AND($M$88=4,$M$89=\"X\"),VLOOKUP(SMALL($J$100:$J$101,2),$J$100:$K$101,2,0),IF(AND($M$88=5,$M$89=\"X\"),VLOOKUP(SMALL($J$98:$J$101,2),$J$98:$K$101,2,0),\"\")))),\"\")","v":""},null,null,"",{"$f":"IF(AND($M$88=4,$M$89=\"\"),VLOOKUP(2,'2. Runde Gruppen'!$N$8:$P$10,3,FALSE),IF(AND($M$88=5,$M$89=\"X\"),VLOOKUP(2,'2. Runde Gruppen'!$N$8:$P$10,3,FALSE),\"\"))","v":""},null,null,null,"",null,null,null,null,null,null,null,null,null,null,"B3",null,null,null,null,null,null,null,null,null,null,null,null,null,null,null,null,null,null,null,null,null,null,null,null,"F1",{"$error":"#N/A"},null,null,null,null,null,null,null,null,null,{"$f":"BI101","v":{"$error":"#N/A"}},{"$f":"$BI$102","v":{"$error":"#N/A"}},{"$error":"#N/A"},{"$error":"#N/A"},{"$error":"#N/A"},{"$error":"#N/A"},{"$error":"#N/A"},{"$error":"#N/A"},null,null,null,null,null,null,null,null,null,null,null,null,null,null,null,"B3","",null,null,6,null,6]
[null,1,"G1",{"$f":"VLOOKUP(1,$N$68:$P$72,3,FALSE)","v":{"$error":"#N/A"}},{"$f":"IFERROR(VLOOKUP(D96,Finals!$B$4:$C$26,2,FALSE),\"\")","v":""},{"$f":"IFERROR(VLOOKUP(D96,Finals!$J$6:$K$24,2,FALSE),\"\")","v":""},{"$f":"IFERROR(VLOOKUP(D96,Finals!$Q$10:$R$20,2,FALSE),\"\")","v":""},{"$f":"IFERROR(VLOOKUP(D96,Finals!$X$23:$Y$24,2,FALSE),\"\")","v":""},{"$f":"IFERROR(VLOOKUP(D96,Finals!$X$14:$Y$15,2,FALSE),\"\")","v":""},null,null,null,{"$f":"IFERROR(IF($M$87<24,\"\",D96),\"\")","v":""},"",null,{"$f":"IFERROR(IF(M87=11,D106,IF(AND($M$88=3,$M$89=\"X\"),VLOOKUP(SMALL($J$98:$J$101,3),$J$98:$K$101,2,0),IF(AND($M$88=4,$M$89=\"X\"),VLOOKUP(SMALL($J$98:$J$99,1),$J$98:$K$99,2,0),IF(AND($M$88=5,$M$89=\"X\"),VLOOKUP(SMALL($J$98:$J$101,3),$J$98:$K$101,2,0),\"\")))),\"\")","v":""},null,null,"",{"$f":"IF(AND($M$88=4,$M$89=\"\"),VLOOKUP(2,'2. Runde Gruppen'!$N$13:$P$15,3,FALSE),IF(AND($M$88=5,$M$89=\"X\"),VLOOKUP(2,'2. Runde Gruppen'!$N$13:$P$15,3,FALSE),\"\"))","v":""},null,null,null,"",null,null,null,null,null,null,null,null,null,null,"C1",null,null,null,null,null,null,null,null,null,null,null,null,null,null,null,null,null,null,null,null,null,null,null,null,"G1",{"$error":"#N/A"},null,null,null,{"$f":"BI92","v":{"$error":"#N/A"}},null,null,null,null,null,{"$f":"$BI$92","v":{"$error":"#N/A"}},{"$f":"$BI$92","v":{"$error":"#N/A"}},{"$error":"#N/A"},{"$error":"#N/A"},{"$error":"#N/A"},{"$error":"#N/A"},{"$error":"#N/A"},{"$error":"#N/A"},null,null,null,null,null,null,null,null,null,null,null,null,null,null,null,"C1","",null,null,7,null,7]
[null,1,"H1",{"$f":"VLOOKUP(1,$N$79:$P$83,3,FALSE)","v":{"$error":"#N/A"}},{"$f":"IFERROR(VLOOKUP(D97,Finals!$B$4:$C$26,2,FALSE),\"\")","v":""},{"$f":"IFERROR(VLOOKUP(D97,Finals!$J$6:$K$24,2,FALSE),\"\")","v":""},{"$f":"IFERROR(VLOOKUP(D97,Finals!$Q$10:$R$20,2,FALSE),\"\")","v":""},{"$f":"IFERROR(VLOOKUP(D97,Finals!$X$23:$Y$24,2,FALSE),\"\")","v":""},{"$f":"IFERROR(VLOOKUP(D97,Finals!$X$14:$Y$15,2,FALSE),\"\")","v":""},"paste",null,null,"","",null,{"$f":"IFERROR(IF(M87=11,D107,IF(AND($M$88=3,$M$89=\"X\"),VLOOKUP(SMALL($J$98:$J$101,4),$J$98:$K$101,2,0),IF(AND($M$88=4,$M$89=\"X\"),VLOOKUP(SMALL($J$98:$J$99,2),$J$98:$K$99,2,0),IF(AND($M$88=5,$M$89=\"X\"),VLOOKUP(SMALL($J$98:$J$101,4),$J$98:$K$101,2,0),\"\")))),\"\")","v":""},null,null,"",{"$f":"IF(AND($M$88=4,$M$89=\"\"),VLOOKUP(2,'2. Runde Gruppen'!$N$18:$P$20,3,FALSE),IF(AND($M$88=5,$M$89=\"X\"),VLOOKUP(2,'2. Runde Gruppen'!$N$18:$P$20,3,FALSE),\"\"))","v":""},null,null,null,"",null,null,null,null,null,null,null,null,null,null,"C2",null,null,null,null,null,null,null,null,null,null,null,null,null,null,null,null,null,null,null,null,null,null,null,null,"H1",{"$error":"#N/A"},null,null,null,{"$f":"BI99","v":{"$error":"#N/A"}},null,null,null,null,null,{"$f":"BI98","v":{"$error":"#N/A"}},{"$f":"$BI$98","v":{"$error":"#N/A"}},{"$error":"#N/A"},{"$error":"#N/A"},{"$error":"#N/A"},{"$error":"#N/A"},{"$error":"#N/A"},{"$error":"#N/A"},null,null,null,null,null,null,null,null,null,null,null,null,null,null,null,"C2","",null,null,8,null,8]
[{"$f":"RAND()","v":0.35344126215012961},2,"A2",{"$f":"VLOOKUP(2,$N$2:$P$6,3,FALSE)","v":{"$error":"#N/A"}},{"$f":"IFERROR(VLOOKUP(D98,Finals!$B$4:$C$26,2,FALSE),\"\")","v":""},{"$f":"IFERROR(VLOOKUP(D98,Finals!$J$6:$K$24,2,FALSE),\"\")","v":""},{"$f":"IFERROR(VLOOKUP(D98,Finals!$Q$10:$R$20,2,FALSE),\"\")","v":""},{"$f":"IFERROR(VLOOKUP(D98,Finals!$X$23:$Y$24,2,FALSE),\"\")","v":""},{"$f":"IFERROR(VLOOKUP(D98,Finals!$X$14:$Y$15,2,FALSE),\"\")","v":""},null,{"$f":"D98","v":{"$error":"#N/A"}},null,{"$f":"SMALL(1,$J$102:$J$105)","v":{"$error":"#VALUE!"}},{"$f":"IFERROR(IF(AND($M$88=6,$M$89=\"X\"),VLOOKUP(SMALL($J$98:$J$101,1),$J$98:$K$101,2,0),\"\"),\"\")","v":""},null,{"$f":"IFERROR(IF(AND($M$88=3,$M$89=\"X\"),VLOOKUP(SMALL($J$98:$J$101,1),$J$98:$K$101,2,0),IF(AND($M$88=4,$M$89=\"X\"),VLOOKUP(SMALL($J$98:$J$101,1),$J$98:$K$101,2,0),IF(AND($M$88=5,$M$89=\"X\"),VLOOKUP(SMALL($J$98:$J$101,1),$J$98:$K$101,2,0),\"\"))),\"\")","v":""},null,null,null,null,null,null,null,"",null,null,null,null,null,null,null,null,null,null,"C3",null,null,null,null,null,null,null,null,null,null,null,null,null,null,null,null,null,null,null,null,null,null,null,null,"A2",{"$error":"#N/A"},null,null,null,null,null,null,null,null,null,{"$f":"BI102","v":{"$error":"#N/A"}},{"$f":"$BI$103","v":{"$error":"#N/A"}},{"$error":"#N/A"},{"$error":"#N/A"},{"$error":"#N/A"},{"$error":"#N/A"},{"$error":"#N/A"},{"$error":"#N/A"},null,null,null,null,null,null,null,null,null,null,null,null,null,null,null,"C3","",null,null,9]
[{"$f":"RAND()","v":0.24897688897251735},2,"B2",{"$f":"VLOOKUP(2,$N$13:$P$17,3,FALSE)","v":{"$error":"#N/A"}},{"$f":"IFERROR(VLOOKUP(D99,Finals!$B$4:$C$26,2,FALSE),\"\")","v":""},{"$f":"IFERROR(VLOOKUP(D99,Finals!$J$6:$K$24,2,FALSE),\"\")","v":""},{"$f":"IFERROR(VLOOKUP(D99,Finals!$Q$10:$R$20,2,FALSE),\"\")","v":""},{"$f":"IFERROR(VLOOKUP(D99,Finals!$X$23:$Y$24,2,FALSE),\"\")","v":""},{"$f":"IFERROR(VLOOKUP(D99,Finals!$X$14:$Y$15,2,FALSE),\"\")","v":""},null,{"$f":"D99","v":{"$error":"#N/A"}},null,{"$f":"SMALL(2,$J$102:$J$105)","v":{"$error":"#VALUE!"}},{"$f":"IFERROR(IF(AND($M$88=6,$M$89=\"X\"),VLOOKUP(SMALL($J$98:$J$101,2),$J$98:$K$101,2,0),\"\"),\"\")","v":""},null,{"$f":"IFERROR(IF(AND($M$88=3,$M$89=\"X\"),VLOOKUP(SMALL($J$98:$J$101,2),$J$98:$K$101,2,0),IF(AND($M$88=4,$M$89=\"X\"),VLOOKUP(SMALL($J$98:$J$101,2),$J$98:$K$101,2,0),IF(AND($M$88=5,$M$89=\"X\"),VLOOKUP(SMALL($J$98:$J$101,2),$J$98:$K$101,2,0),\"\"))),\"\")","v":""},null,null,null,null,null,null,null,"",null,null,null,null,null,null,null,null,null,null,"D1",null,null,null,null,null,null,null,null,null,null,null,null,null,null,null,null,null,null,null,null,null,null,null,null,"B2",{"$error":"#N/A"},null,null,null,{"$f":"BI98","v":{"$error":"#N/A"}},null,null,null,null,null,{"$f":"$BI$93","v":{"$error":"#N/A"}},{"$f":"$BI$93","v":{"$error":"#N/A"}},{"$error":"#N/A"},{"$error":"#N/A"},{"$error":"#N/A"},{"$error":"#N/A"},{"$error":"#N/A"},{"$error":"#N/A"},null,null,null,null,null,null,null,null,null,null,null,null,null,null,null,"D1","",null,null,10]
[0.52369143695277676,2,"C2",{"$f":"VLOOKUP(2,$N$24:$P$28,3,FALSE)","v":{"$error":"#N/A"}},{"$f":"IFERROR(VLOOKUP(D100,Finals!$B$4:$C$26,2,FALSE),\"\")","v":""},{"$f":"IFERROR(VLOOKUP(D100,Finals!$J$6:$K$24,2,FALSE),\"\")","v":""},{"$f":"IFERROR(VLOOKUP(D100,Finals!$Q$10:$R$20,2,FALSE),\"\")","v":""},{"$f":"IFERROR(VLOOKUP(D100,Finals!$X$23:$Y$24,2,FALSE),\"\")","v":""},{"$f":"IFERROR(VLOOKUP(D100,Finals!$X$14:$Y$15,2,FALSE),\"\")","v":""},null,{"$error":"#N/A"},null,{"$f":"SMALL(3,$J$102:$J$105)","v":{"$error":"#VALUE!"}},{"$f":"IFERROR(IF(AND($M$88=6,$M$89=\"X\"),VLOOKUP(SMALL($J$98:$J$101,3),$J$98:$K$101,2,0),\"\"),\"\")","v":""},null,{"$f":"IFERROR(IF(AND($M$88=3,$M$89=\"X\"),VLOOKUP(SMALL($J$98:$J$101,3),$J$98:$K$101,2,0),IF(AND($M$88=4,$M$89=\"X\"),VLOOKUP(SMALL($J$98:$J$101,3),$J$98:$K$101,2,0),IF(AND($M$88=5,$M$89=\"X\"),VLOOKUP(SMALL($J$98:$J$101,3),$J$98:$K$101,2,0),\"\"))),\"\")","v":""},null,null,null,null,null,null,null,"",null,null,null,null,null,null,null,null,null,null,"D2",null,null,null,null,null,null,null,null,null,null,null,null,null,null,null,null,null,null,null,null,null,null,null,null,"C2",{"$error":"#N/A"},null,null,null,{"$f":"BI100","v":{"$error":"#N/A"}},null,null,null,null,null,{"$f":"BI99","v":{"$error":"#N/A"}},{"$f":"$BI$95","v":{"$error":"#N/A"}},{"$error":"#N/A"},{"$error":"#N/A"},{"$error":"#N/A"},{"$error":"#N/A"},{"$error":"#N/A"},{"$error":"#N/A"},null,null,null,null,null,null,null,null,null,null,null,null,null,null,null,"D2","",null,null,11]
[6.7079091990424833E-2,2,"D2",{"$f":"VLOOKUP(2,$N$35:$P$39,3,FALSE)","v":{"$error":"#N/A"}},{"$f":"IFERROR(VLOOKUP(D101,Finals!$B$4:$C$26,2,FALSE),\"\")","v":""},{"$f":"IFERROR(VLOOKUP(D101,Finals!$J$6:$K$24,2,FALSE),\"\")","v":""},{"$f":"IFERROR(VLOOKUP(D101,Finals!$Q$10:$R$20,2,FALSE),\"\")","v":""},{"$f":"IFERROR(VLOOKUP(D101,Finals!$X$23:$Y$24,2,FALSE),\"\")","v":""},{"$f":"IFERROR(VLOOKUP(D101,Finals!$X$14:$Y$15,2,FALSE),\"\")","v":""},null,{"$error":"#N/A"},null,{"$f":"SMALL(4,$J$102:$J$105)","v":{"$error":"#VALUE!"}},{"$f":"IFERROR(IF(AND($M$88=6,$M$89=\"X\"),VLOOKUP(SMALL($J$98:$J$101,4),$J$98:$K$101,2,0),\"\"),\"\")","v":""},null,{"$f":"IFERROR(IF(AND($M$88=3,$M$89=\"X\"),VLOOKUP(SMALL($J$98:$J$101,4),$J$98:$K$101,2,0),IF(AND($M$88=4,$M$89=\"X\"),VLOOKUP(SMALL($J$98:$J$101,4),$J$98:$K$101,2,0),IF(AND($M$88=5,$M$89=\"X\"),VLOOKUP(SMALL($J$98:$J$101,4),$J$98:$K$101,2,0),\"\"))),\"\")","v":""},null,null,null,null,null,null,null,"",null,null,null,null,null,null,null,null,null,null,"D3",null,null,null,null,null,null,null,null,null,null,null,null,null,null,null,null,null,null,null,null,null,null,null,null,"D2",{"$error":"#N/A"},null,null,null,null,null,null,null,null,null,{"$f":"BI106","v":{"$error":"#N/A"}},{"$f":"$BI$99","v":{"$error":"#N/A"}},{"$error":"#N/A"},{"$error":"#N/A"},{"$error":"#N/A"},{"$error":"#N/A"},{"$error":"#N/A"},{"$error":"#N/A"},null,null,null,null,null,null,null,null,null,null,null,null,null,null,null,"D3","",null,null,12]
[0.48077997615174006,2,"E2",{"$f":"VLOOKUP(2,$N$46:$P$50,3,FALSE)","v":{"$error":"#N/A"}},{"$f":"IFERROR(VLOOKUP(D102,Finals!$B$4:$C$26,2,FALSE),\"\")","v":""},{"$f":"IFERROR(VLOOKUP(D102,Finals!$J$6:$K$24,2,FALSE),\"\")","v":""},{"$f":"IFERROR(VLOOKUP(D102,Finals!$Q$10:$R$20,2,FALSE),\"\")","v":""},{"$f":"IFERROR(VLOOKUP(D102,Finals!$X$23:$Y$24,2,FALSE),\"\")","v":""},{"$f":"IFERROR(VLOOKUP(D102,Finals!$X$14:$Y$15,2,FALSE),\"\")","v":""},null,{"$error":"#N/A"},null,{"$f":"SMALL(1,$J$98:$J$101)","v":{"$error":"#VALUE!"}},{"$f":"IFERROR(IF(AND($M$88=6,$M$89=\"X\"),VLOOKUP(SMALL($J$102:$J$105,1),$J$102:$K$105,2,0),\"\"),\"\")","v":""},null,null,null,null,null,null,null,null,null,0,null,null,null,null,null,null,null,null,null,null,null,null,null,null,null,null,null,null,null,null,null,null,null,null,null,null,null,null,null,null,null,null,null,null,null,"E2",{"$error":"#N/A"},null,null,null,null,null,null,null,null,null,null,null,null,null,null,null,null,null,null,null,null,null,null,null,null,null,null,null,null,null,null,null,null,null,null,null,null,13]
[0.4934791245583342,2,"F2",{"$f":"VLOOKUP(2,$N$57:$P$61,3,FALSE)","v":{"$error":"#N/A"}},{"$f":"IFERROR(VLOOKUP(D103,Finals!$B$4:$C$26,2,FALSE),\"\")","v":""},{"$f":"IFERROR(VLOOKUP(D103,Finals!$J$6:$K$24,2,FALSE),\"\")","v":""},{"$f":"IFERROR(VLOOKUP(D103,Finals!$Q$10:$R$20,2,FALSE),\"\")","v":""},{"$f":"IFERROR(VLOOKUP(D103,Finals!$X$23:$Y$24,2,FALSE),\"\")","v":""},{"$f":"IFERROR(VLOOKUP(D103,Finals!$X$14:$Y$15,2,FALSE),\"\")","v":""},null,{"$error":"#N/A"},null,{"$f":"SMALL(2,$J$98:$J$101)","v":{"$error":"#VALUE!"}},{"$f":"IFERROR(IF(AND($M$88=6,$M$89=\"X\"),VLOOKUP(SMALL($J$102:$J$105,2),$J$102:$K$105,2,0),\"\"),\"\")","v":""},null,null,null,null,null,null,null,null,null,0,null,null,null,null,null,null,null,null,null,null,null,null,null,null,null,null,null,null,null,null,null,null,null,null,null,null,null,null,null,null,null,null,null,null,null,"F2",{"$error":"#N/A"},null,null,null,null,null,null,null,null,null,null,null,null,null,null,null,null,null,null,null,null,null,null,null,null,null,null,null,null,null,null,null,null,null,null,null,null,14]
[0.59667577087549395,2,"G2",{"$f":"VLOOKUP(2,$N$68:$P$72,3,FALSE)","v":{"$error":"#N/A"}},{"$f":"IFERROR(VLOOKUP(D104,Finals!$B$4:$C$26,2,FALSE),\"\")","v":""},{"$f":"IFERROR(VLOOKUP(D104,Finals!$J$6:$K$24,2,FALSE),\"\")","v":""},{"$f":"IFERROR(VLOOKUP(D104,Finals!$Q$10:$R$20,2,FALSE),\"\")","v":""},{"$f":"IFERROR(VLOOKUP(D104,Finals!$X$23:$Y$24,2,FALSE),\"\")","v":""},{"$f":"IFERROR(VLOOKUP(D104,Finals!$X$14:$Y$15,2,FALSE),\"\")","v":""},null,{"$error":"#N/A"},null,{"$f":"SMALL(3,$J$98:$J$101)","v":{"$error":"#VALUE!"}},{"$f":"IFERROR(IF(AND($M$88=6,$M$89=\"X\"),VLOOKUP(SMALL($J$102:$J$105,3),$J$102:$K$105,2,0),\"\"),\"\")","v":""},null,null,null,null,null,null,null,null,null,0,null,null,null,null,null,null,null,null,null,null,null,null,null,null,null,null,null,null,null,null,null,null,null,null,null,null,null,null,null,null,null,null,null,null,null,"G2",{"$error":"#N/A"},null,null,null,null,null,null,null,null,null,null,null,null,null,null,null,null,null,null,null,null,null,null,null,null,null,null,null,null,null,null,null,null,null,null,null,null,15]
[0.67705772721652469,2,"H2",{"$f":"VLOOKUP(2,$N$79:$P$83,3,FALSE)","v":{"$error":"#N/A"}},{"$f":"IFERROR(VLOOKUP(D105,Finals!$B$4:$C$26,2,FALSE),\"\")","v":""},{"$f":"IFERROR(VLOOKUP(D105,Finals!$J$6:$K$24,2,FALSE),\"\")","v":""},{"$f":"IFERROR(VLOOKUP(D105,Finals!$Q$10:$R$20,2,FALSE),\"\")","v":""},{"$f":"IFERROR(VLOOKUP(D105,Finals!$X$23:$Y$24,2,FALSE),\"\")","v":""},{"$f":"IFERROR(VLOOKUP(D105,Finals!$X$14:$Y$15,2,FALSE),\"\")","v":""},null,{"$error":"#N/A"},null,{"$f":"SMALL(4,$J$98:$J$101)","v":{"$error":"#VALUE!"}},{"$f":"IFERROR(IF(AND($M$88=6,$M$89=\"X\"),VLOOKUP(SMALL($J$102:$J$105,4),$J$102:$K$105,2,0),\"\"),\"\")","v":""},null,null,null,null,null,null,null,null,null,0,null,null,null,null,null,null,null,null,null,null,null,null,null,null,null,null,null,null,null,null,null,null,null,null,null,null,null,null,null,null,null,null,null,null,null,"H2",{"$error":"#N/A"},null,null,null,null,null,null,null,null,null,null,null,null,null,null,null,null,null,null,null,null,null,null,null,null,null,null,null,null,null,null,null,null,null,null,null,null,16]
[null,3,"A3",{"$f":"VLOOKUP(3,$N$2:$P$6,3,FALSE)","v":{"$error":"#N/A"}},{"$f":"IFERROR(VLOOKUP(D106,Finals!$B$4:$C$26,2,FALSE),\"\")","v":""},{"$f":"IFERROR(VLOOKUP(D106,Finals!$J$6:$K$24,2,FALSE),\"\")","v":""},{"$f":"IFERROR(VLOOKUP(D106,Finals!$Q$10:$R$20,2,FALSE),\"\")","v":""},{"$f":"IFERROR(VLOOKUP(D106,Finals!$X$23:$Y$24,2,FALSE),\"\")","v":""},{"$f":"IFERROR(VLOOKUP(D106,Finals!$X$14:$Y$15,2,FALSE),\"\")","v":""},null,null,null,{"$f":"IF($M$87=11,P90,\"\")","v":""},{"$f":"IFERROR(IF($M$87=11,D106,\"\"),\"\")","v":""},null,null,null,null,null,null,null,null,null,null,null,null,null,null,null,null,null,null,null,null,null,null,null,null,null,null,null,null,null,null,null,null,null,null,null,null,null,null,null,null,null,null,null,null,null,"A3",{"$error":"#N/A"}]
[null,3,"B3",{"$f":"VLOOKUP(3,$N$13:$P$17,3,FALSE)","v":{"$error":"#N/A"}},{"$f":"IFERROR(VLOOKUP(D107,Finals!$B$4:$C$26,2,FALSE),\"\")","v":""},{"$f":"IFERROR(VLOOKUP(D107,Finals!$J$6:$K$24,2,FALSE),\"\")","v":""},{"$f":"IFERROR(VLOOKUP(D107,Finals!$Q$10:$R$20,2,FALSE),\"\")","v":""},{"$f":"IFERROR(VLOOKUP(D107,Finals!$X$23:$Y$24,2,FALSE),\"\")","v":""},{"$f":"IFERROR(VLOOKUP(D107,Finals!$X$14:$Y$15,2,FALSE),\"\")","v":""},null,null,null,{"$f":"IF($M$87=11,P91,\"\")","v":""},{"$f":"IFERROR(IF($M$87=11,D107,\"\"),\"\")","v":""},null,null,null,null,null,null,null,null,null,null,null,null,null,null,null,null,null,null,null,null,null,null,null,null,null,null,null,null,null,null,null,null,null,null,null,null,null,null,null,null,null,null,null,null,null,"B3",{"$error":"#N/A"}]
[null,3,"C3",{"$f":"VLOOKUP(3,$N$24:$P$28,3,FALSE)","v":{"$error":"#N/A"}},{"$f":"IFERROR(VLOOKUP(D108,Finals!$B$4:$C$26,2,FALSE),\"\")","v":""},{"$f":"IFERROR(VLOOKUP(D108,Finals!$J$6:$K$24,2,FALSE),\"\")","v":""},{"$f":"IFERROR(VLOOKUP(D108,Finals!$Q$10:$R$20,2,FALSE),\"\")","v":""},{"$f":"IFERROR(VLOOKUP(D108,Finals!$X$23:$Y$24,2,FALSE),\"\")","v":""},{"$f":"IFERROR(VLOOKUP(D108,Finals!$X$14:$Y$15,2,FALSE),\"\")","v":""},null,null,null,{"$f":"IF($M$87=11,P92,\"\")","v":""},null,null,null,null,null,null,null,null,null,null,null,null,null,null,null,null,null,null,null,null,null,null,null,null,null,null,null,null,null,null,null,null,null,null,null,null,null,null,null,null,null,null,null,null,null,null,"C3",{"$error":"#N/A"}]
[null,3,"D3",{"$f":"VLOOKUP(3,$N$35:$P$39,3,FALSE)","v":{"$error":"#N/A"}},{"$f":"IFERROR(VLOOKUP(D109,Finals!$B$4:$C$26,2,FALSE),\"\")","v":""},{"$f":"IFERROR(VLOOKUP(D109,Finals!$J$6:$K$24,2,FALSE),\"\")","v":""},{"$f":"IFERROR(VLOOKUP(D109,Finals!$Q$10:$R$20,2,FALSE),\"\")","v":""},{"$f":"IFERROR(VLOOKUP(D109,Finals!$X$23:$Y$24,2,FALSE),\"\")","v":""},{"$f":"IFERROR(VLOOKUP(D109,Finals!$X$14:$Y$15,2,FALSE),\"\")","v":""},null,null,null,null,null,null,null,null,null,null,null,null,null,null,null,null,null,null,null,null,null,null,null,null,null,null,null,null,null,null,null,null,null,null,null,null,null,null,null,null,null,null,null,null,null,null,null,null,null,null,"D3",{"$error":"#N/A"}]
[null,3,"E3",{"$f":"VLOOKUP(3,$N$46:$P$50,3,FALSE)","v":{"$error":"#N/A"}},{"$f":"IFERROR(VLOOKUP(D110,Finals!$B$4:$C$26,2,FALSE),\"\")","v":""},{"$f":"IFERROR(VLOOKUP(D110,Finals!$J$6:$K$24,2,FALSE),\"\")","v":""},{"$f":"IFERROR(VLOOKUP(D110,Finals!$Q$10:$R$20,2,FALSE),\"\")","v":""},{"$f":"IFERROR(VLOOKUP(D110,Finals!$X$23:$Y$24,2,FALSE),\"\")","v":""},{"$f":"IFERROR(VLOOKUP(D110,Finals!$X$14:$Y$15,2,FALSE),\"\")","v":""},null,null,null,null,null,null,null,null,null,null,null,null,null,null,null,null,null,null,null,null,null,null,null,null,null,null,null,null,null,null,null,null,null,null,null,null,null,null,null,null,null,null,null,null,null,null,null,null,null,null,"E3",{"$error":"#N/A"}]
[null,3,"F3",{"$f":"VLOOKUP(3,$N$57:$P$61,3,FALSE)","v":{"$error":"#N/A"}},{"$f":"IFERROR(VLOOKUP(D111,Finals!$B$4:$C$26,2,FALSE),\"\")","v":""},{"$f":"IFERROR(VLOOKUP(D111,Finals!$J$6:$K$24,2,FALSE),\"\")","v":""},{"$f":"IFERROR(VLOOKUP(D111,Finals!$Q$10:$R$20,2,FALSE),\"\")","v":""},{"$f":"IFERROR(VLOOKUP(D111,Finals!$X$23:$Y$24,2,FALSE),\"\")","v":""},{"$f":"IFERROR(VLOOKUP(D111,Finals!$X$14:$Y$15,2,FALSE),\"\")","v":""},null,null,null,null,null,null,null,null,null,null,null,null,null,null,null,null,null,null,null,null,null,null,null,null,null,null,null,null,null,null,null,null,null,null,null,null,null,null,null,null,null,null,null,null,null,null,null,null,null,null,"F3",{"$error":"#N/A"}]
[null,3,"G3",{"$f":"VLOOKUP(3,$N$68:$P$72,3,FALSE)","v":{"$error":"#N/A"}},{"$f":"IFERROR(VLOOKUP(D112,Finals!$B$4:$C$26,2,FALSE),\"\")","v":""},{"$f":"IFERROR(VLOOKUP(D112,Finals!$J$6:$K$24,2,FALSE),\"\")","v":""},{"$f":"IFERROR(VLOOKUP(D112,Finals!$Q$10:$R$20,2,FALSE),\"\")","v":""},{"$f":"IFERROR(VLOOKUP(D112,Finals!$X$23:$Y$24,2,FALSE),\"\")","v":""},{"$f":"IFERROR(VLOOKUP(D112,Finals!$X$14:$Y$15,2,FALSE),\"\")","v":""},null,null,null,null,null,null,null,null,null,null,null,null,null,null,null,null,null,null,null,null,null,null,null,null,null,null,null,null,null,null,null,null,null,null,null,null,null,null,null,null,null,null,null,null,null,null,null,null,null,null,"G3",{"$error":"#N/A"}]
[null,3,"H3",{"$f":"VLOOKUP(3,$N$79:$P$83,3,FALSE)","v":{"$error":"#N/A"}},{"$f":"IFERROR(VLOOKUP(D113,Finals!$B$4:$C$26,2,FALSE),\"\")","v":""},{"$f":"IFERROR(VLOOKUP(D113,Finals!$J$6:$K$24,2,FALSE),\"\")","v":""},{"$f":"IFERROR(VLOOKUP(D113,Finals!$Q$10:$R$20,2,FALSE),\"\")","v":""},{"$f":"IFERROR(VLOOKUP(D113,Finals!$X$23:$Y$24,2,FALSE),\"\")","v":""},{"$f":"IFERROR(VLOOKUP(D113,Finals!$X$14:$Y$15,2,FALSE),\"\")","v":""},null,null,null,null,null,null,null,null,null,null,null,null,null,null,null,null,null,null,null,null,null,null,null,null,null,null,null,null,null,null,null,null,null,null,null,null,null,null,null,null,null,null,null,null,null,null,null,null,null,null,"H3",{"$error":"#N/A"}]
["Punkteberechnung",null,null,null,null,null,null,null,null,null,null,null,null,null,null,null,null,null,null,null,null,null,null,null,null,null,null,null,null,null,null,null,null,null,null,null,null,null,null,null,null,null,null,null,null,null,null,null,null,null,null,null,null,null,null,null,null,null,null,null,null,null,null,null,null,null,null,null,{"$f":"BH1","v":0}]
["Nr","Name",null,"Teilnahme","F+ 1","F+ 2","AF","VF","4.",null,"GR2",null,null,"3/4","1/2",null,"PR2",null,null,null,"Su","x5","Su",null,"AF","VF",4,3,2,null,null,"Break 30 Matches",null,null,null,null,null,null,null,null,null,null,null,null,null,null,null,null,null,null,null,null,null,null,null,null,null,1,"Höchste","Fr+","Gesamt",null,"Platz",null,null,null,null,null,{"$f":"IF(Finals!Y14+Finals!Y15>=1,\"X\",0)","v":0},null,null,"Oli"]
[{"$f":"Spieler!A2","v":1},{"$f":"Spieler!C2","v":""},null,{"$f":"IF(B116=\"\",\"\",$H$165)","v":""},{"$f":"IF(B116=\"\",\"\",VLOOKUP(B116,$D$1:$H$83,5,FALSE))","v":""},{"$f":"IFERROR(IF(B116=\"\",\"\",VLOOKUP(B116,'2. Runde Gruppen'!$D$3:$H$20,5,FALSE)),\"\")","v":""},{"$f":"IFERROR(VLOOKUP(B116,$D$90:$E$113,2,FALSE),\"\")","v":""},{"$f":"IFERROR(VLOOKUP(B116,$D$90:$F$113,3,FALSE),\"\")","v":""},{"$f":"IFERROR(VLOOKUP(B116,$D$90:$G$113,4,FALSE),\"\")","v":""},null,null,null,null,{"$f":"IFERROR(VLOOKUP(B116,$D$90:$H$113,5,FALSE),\"\")","v":""},{"$f":"IFERROR(VLOOKUP(B116,$D$90:$I$113,6,FALSE),\"\")","v":""},null,{"$f":"IF(OR(F116<>\"\",G116<>\"\"),Berechnung!$H$164,D116)","v":""},{"$f":"IF(Q116<>\"\",Q116,D116)","v":""},null,4.0000000000000001E-3,{"$f":"SUM(E116:O116)","v":0},{"$f":"U116*5+T116","v":4.0000000000000001E-3},{"$f":"IF(B116=\"\",\"\",V116+R116+X116)","v":""},{"$f":"D116","v":""},{"$f":"IF(AND(D116=30,G116<>\"\"),$E$164,IF(AND(D116=50,G116<>\"\"),$H$164,\"\"))","v":""},{"$f":"IF(AND(D116=20,H116<>\"\"),$D$163,IF(AND(D116=30,H116<>\"\"),$E$163,IF(AND(D116=50,H116<>\"\"),$H$163,\"\")))","v":""},{"$f":"IF(B116=\"\",\"\",IF(B116=Finals!$X$7,Berechnung!$H$162,\"\"))","v":""},{"$f":"IF(B116=\"\",\"\",IF(B116=Finals!$X$6,Berechnung!$H$161,\"\"))","v":""},{"$f":"IF(B116=\"\",\"\",IF(B116=Finals!$X$5,Berechnung!$H$160,\"\"))","v":""},{"$f":"IF(E116=Finals!$X$7,Berechnung!$H$162,\"\")","v":90},null,null,null,null,null,null,null,null,null,null,null,null,null,null,null,null,null,null,null,null,null,null,null,null,null,null,null,{"$f":"IF(B116=\"\",\"\",IF(B116=Finals!$X$4,Berechnung!$H$159,\"\"))","v":""},{"$f":"IFERROR(IF(B116=\"\",\"\",LARGE(Y116:BF116:BF116,1)),0)","v":""},{"$f":"IFERROR(IF(B116=\"\",\"\",IF(BG116<>0,V116+T116,IF(BG116=0,R116+T116+V116))),\"\")","v":""},{"$f":"IFERROR(BG116+BH116,\"\")","v":""},{"$f":"B116","v":""},{"$f":"IF(B116=\"\",\"\",A116)","v":""},{"$f":"IFERROR(LARGE($BI$116:$BJ$155,1),\"\")","v":""},{"$f":"IF(BJ116=\"\",\"\",VLOOKUP(BL116,$BI$116:$BJ$155,2,FALSE))","v":""},null,{"$f":"IF(BM116=\"\",\"\",BK116)","v":""},{"$f":"BM116","v":""},{"$f":"BL116","v":""},{"$f":"IF(BO116=\"\",\"\",BQ114*4)","v":""},{"$f":"VLOOKUP(BP116,$B$116:$U$155,20,FALSE)","v":0},{"$f":"IF(BR116=\"\",\"\",BR116+BS116)","v":""}]
[{"$f":"Spieler!A3","v":2},{"$f":"Spieler!C3","v":""},null,{"$f":"IF(B117=\"\",\"\",$H$165)","v":""},{"$f":"IF(B117=\"\",\"\",VLOOKUP(B117,$D$1:$H$83,5,FALSE))","v":""},{"$f":"IFERROR(IF(B117=\"\",\"\",VLOOKUP(B117,'2. Runde Gruppen'!$D$3:$H$20,5,FALSE)),\"\")","v":""},{"$f":"IFERROR(VLOOKUP(B117,$D$90:$E$113,2,FALSE),\"\")","v":""},{"$f":"IFERROR(VLOOKUP(B117,$D$90:$F$113,3,FALSE),\"\")","v":""},{"$f":"IFERROR(VLOOKUP(B117,$D$90:$G$113,4,FALSE),\"\")","v":""},null,null,null,null,{"$f":"IFERROR(VLOOKUP(B117,$D$90:$H$113,5,FALSE),\"\")","v":""},{"$f":"IFERROR(VLOOKUP(B117,$D$90:$I$113,6,FALSE),\"\")","v":""},null,{"$f":"IF(OR(F117<>\"\",G117<>\"\"),Berechnung!$H$164,D117)","v":""},{"$f":"IF(Q117<>\"\",Q117,D117)","v":""},null,3.8999999999999998E-3,{"$f":"SUM(E117:O117)","v":0},{"$f":"U117*5+T117","v":3.8999999999999998E-3},{"$f":"IF(B117=\"\",\"\",V117+R117+X117)","v":""},{"$f":"D117","v":""},{"$f":"IF(AND(D117=30,G117<>\"\"),$E$164,IF(AND(D117=50,G117<>\"\"),$H$164,\"\"))","v":""},{"$f":"IF(AND(D117=20,H117<>\"\"),$D$163,IF(AND(D117=30,H117<>\"\"),$E$163,IF(AND(D117=50,H117<>\"\"),$H$163,\"\")))","v":""},{"$f":"IF(B117=\"\",\"\",IF(B117=Finals!$X$7,Berechnung!$H$162,\"\"))","v":""},{"$f":"IF(B117=\"\",\"\",IF(B117=Finals!$X$6,Berechnung!$H$161,\"\"))","v":""},{"$f":"IF(B117=\"\",\"\",IF(B117=Finals!$X$5,Berechnung!$H$160,\"\"))","v":""},{"$f":"IF(E117=Finals!$X$7,Berechnung!$H$162,\"\")","v":90},null,null,null,null,null,null,null,null,null,null,null,null,null,null,null,null,null,null,null,null,null,null,null,null,null,null,null,{"$f":"IF(B117=\"\",\"\",IF(B117=Finals!$X$4,Berechnung!$H$159,\"\"))","v":""},{"$f":"IFERROR(IF(B117=\"\",\"\",LARGE(Y117:BF117:BF117,1)),0)","v":""},{"$f":"IFERROR(IF(B117=\"\",\"\",IF(BG117<>0,V117+T117,IF(BG117=0,R117+T117+V117))),\"\")","v":""},{"$f":"IFERROR(BG117+BH117,\"\")","v":""},{"$f":"B117","v":""},"",{"$f":"IFERROR(LARGE($BI$116:$BJ$155,2),\"\")","v":""},"",null,{"$f":"IF(BM117=\"\",\"\",BK117)","v":""},{"$f":"BM117","v":""},{"$f":"BL117","v":""},{"$f":"IF(BO117=\"\",\"\",($BQ$114-BO116)*4)","v":""},{"$f":"VLOOKUP(BP117,$B$116:$U$155,20,FALSE)","v":0},{"$f":"IF(BR117=\"\",\"\",BR117+BS117)","v":""}]
[{"$f":"Spieler!A4","v":3},{"$f":"Spieler!C4","v":""},null,"","",{"$f":"IFERROR(IF(B118=\"\",\"\",VLOOKUP(B118,'2. Runde Gruppen'!$D$3:$H$20,5,FALSE)),\"\")","v":""},"","","",null,null,null,null,"","",null,{"$f":"IF(OR(F118<>\"\",G118<>\"\"),Berechnung!$H$164,D118)","v":""},"",null,3.8E-3,0,{"$f":"U118*5+T118","v":3.8E-3},{"$f":"IF(B118=\"\",\"\",V118+R118+X118)","v":""},"","","",{"$f":"IF(B118=\"\",\"\",IF(B118=Finals!$X$7,Berechnung!$H$162,\"\"))","v":""},{"$f":"IF(B118=\"\",\"\",IF(B118=Finals!$X$6,Berechnung!$H$161,\"\"))","v":""},{"$f":"IF(B118=\"\",\"\",IF(B118=Finals!$X$5,Berechnung!$H$160,\"\"))","v":""},{"$f":"IF(E118=Finals!$X$7,Berechnung!$H$162,\"\")","v":90},null,null,null,null,null,null,null,null,null,null,null,null,null,null,null,null,null,null,null,null,null,null,null,null,null,null,null,{"$f":"IF(B118=\"\",\"\",IF(B118=Finals!$X$4,Berechnung!$H$159,\"\"))","v":""},{"$f":"IFERROR(IF(B118=\"\",\"\",LARGE(Y118:BF118:BF118,1)),0)","v":""},"",{"$f":"IFERROR(BG118+BH118,\"\")","v":""},"","",{"$f":"IFERROR(LARGE($BI$116:$BJ$155,3),\"\")","v":""},"",null,"","","",{"$f":"IF(BO118=\"\",\"\",($BQ$114-BO117)*4)","v":""},0,""]
[{"$f":"Spieler!A5","v":4},{"$f":"Spieler!C5","v":""},null,"","",{"$f":"IFERROR(IF(B119=\"\",\"\",VLOOKUP(B119,'2. Runde Gruppen'!$D$3:$H$20,5,FALSE)),\"\")","v":""},"","","",null,null,null,null,"","",null,{"$f":"IF(OR(F119<>\"\",G119<>\"\"),Berechnung!$H$164,D119)","v":""},"",null,3.7000000000000002E-3,0,3.7000000000000002E-3,"","","","",{"$f":"IF(B119=\"\",\"\",IF(B119=Finals!$X$7,Berechnung!$H$162,\"\"))","v":""},{"$f":"IF(B119=\"\",\"\",IF(B119=Finals!$X$6,Berechnung!$H$161,\"\"))","v":""},{"$f":"IF(B119=\"\",\"\",IF(B119=Finals!$X$5,Berechnung!$H$160,\"\"))","v":""},{"$f":"IF(E119=Finals!$X$7,Berechnung!$H$162,\"\")","v":90},null,null,null,null,null,null,null,null,null,null,null,null,null,null,null,null,null,null,null,null,null,null,null,null,null,null,null,{"$f":"IF(B119=\"\",\"\",IF(B119=Finals!$X$4,Berechnung!$H$159,\"\"))","v":""},{"$f":"IFERROR(IF(B119=\"\",\"\",LARGE(Y119:BF119:BF119,1)),0)","v":""},"",{"$f":"IFERROR(BG119+BH119,\"\")","v":""},"","",{"$f":"IFERROR(LARGE($BI$116:$BJ$155,4),\"\")","v":""},"",null,"","","","",0,""]
[{"$f":"Spieler!A6","v":5},{"$f":"Spieler!C6","v":""},null,"","",{"$f":"IFERROR(IF(B120=\"\",\"\",VLOOKUP(B120,'2. Runde Gruppen'!$D$3:$H$20,5,FALSE)),\"\")","v":""},"","","",null,null,null,null,"","",null,{"$f":"IF(OR(F120<>\"\",G120<>\"\"),Berechnung!$H$164,D120)","v":""},"",null,3.5999999999999999E-3,0,3.5999999999999999E-3,"","","","",{"$f":"IF(B120=\"\",\"\",IF(B120=Finals!$X$7,Berechnung!$H$162,\"\"))","v":""},{"$f":"IF(B120=\"\",\"\",IF(B120=Finals!$X$6,Berechnung!$H$161,\"\"))","v":""},{"$f":"IF(B120=\"\",\"\",IF(B120=Finals!$X$5,Berechnung!$H$160,\"\"))","v":""},{"$f":"IF(E120=Finals!$X$7,Berechnung!$H$162,\"\")","v":90},null,null,null,null,null,null,null,null,null,null,null,null,null,null,null,null,null,null,null,null,null,null,null,null,null,null,null,{"$f":"IF(B120=\"\",\"\",IF(B120=Finals!$X$4,Berechnung!$H$159,\"\"))","v":""},{"$f":"IFERROR(IF(B120=\"\",\"\",LARGE(Y120:BF120:BF120,1)),0)","v":""},"",{"$f":"IFERROR(BG120+BH120,\"\")","v":""},"","",{"$f":"IFERROR(LARGE($BI$116:$BJ$155,5),\"\")","v":""},"",null,"","","","",0,""]
[{"$f":"Spieler!A7","v":6},{"$f":"Spieler!C7","v":""},null,"","",{"$f":"IFERROR(IF(B121=\"\",\"\",VLOOKUP(B121,'2. Runde Gruppen'!$D$3:$H$20,5,FALSE)),\"\")","v":""},"","","",null,null,null,null,"","",null,{"$f":"IF(OR(F121<>\"\",G121<>\"\"),Berechnung!$H$164,D121)","v":""},"",null,3.5000000000000001E-3,0,3.5000000000000001E-3,"","","","",{"$f":"IF(B121=\"\",\"\",IF(B121=Finals!$X$7,Berechnung!$H$162,\"\"))","v":""},{"$f":"IF(B121=\"\",\"\",IF(B121=Finals!$X$6,Berechnung!$H$161,\"\"))","v":""},{"$f":"IF(B121=\"\",\"\",IF(B121=Finals!$X$5,Berechnung!$H$160,\"\"))","v":""},{"$f":"IF(E121=Finals!$X$7,Berechnung!$H$162,\"\")","v":90},null,null,null,null,null,null,null,null,null,null,null,null,null,null,null,null,null,null,null,null,null,null,null,null,null,null,null,{"$f":"IF(B121=\"\",\"\",IF(B121=Finals!$X$4,Berechnung!$H$159,\"\"))","v":""},{"$f":"IFERROR(IF(B121=\"\",\"\",LARGE(Y121:BF121:BF121,1)),0)","v":""},"",{"$f":"IFERROR(BG121+BH121,\"\")","v":""},"","",{"$f":"IFERROR(LARGE($BI$116:$BJ$155,6),\"\")","v":""},"",null,"","","","",0,""]
[{"$f":"Spieler!A8","v":7},{"$f":"Spieler!C8","v":""},null,"","",{"$f":"IFERROR(IF(B122=\"\",\"\",VLOOKUP(B122,'2. Runde Gruppen'!$D$3:$H$20,5,FALSE)),\"\")","v":""},"","","",null,null,null,null,"","",null,{"$f":"IF(OR(F122<>\"\",G122<>\"\"),Berechnung!$H$164,D122)","v":""},"",null,3.3999999999999998E-3,0,3.3999999999999998E-3,"","","","",{"$f":"IF(B122=\"\",\"\",IF(B122=Finals!$X$7,Berechnung!$H$162,\"\"))","v":""},{"$f":"IF(B122=\"\",\"\",IF(B122=Finals!$X$6,Berechnung!$H$161,\"\"))","v":""},{"$f":"IF(B122=\"\",\"\",IF(B122=Finals!$X$5,Berechnung!$H$160,\"\"))","v":""},{"$f":"IF(E122=Finals!$X$7,Berechnung!$H$162,\"\")","v":90},null,null,null,null,null,null,null,null,null,null,null,null,null,null,null,null,null,null,null,null,null,null,null,null,null,null,null,{"$f":"IF(B122=\"\",\"\",IF(B122=Finals!$X$4,Berechnung!$H$159,\"\"))","v":""},{"$f":"IFERROR(IF(B122=\"\",\"\",LARGE(Y122:BF122:BF122,1)),0)","v":""},"","","","",{"$f":"IFERROR(LARGE($BI$116:$BJ$155,7),\"\")","v":""},"",null,"","","","",0,""]
[{"$f":"Spieler!A9","v":8},{"$f":"Spieler!C9","v":""},null,"","",{"$f":"IFERROR(IF(B123=\"\",\"\",VLOOKUP(B123,'2. Runde Gruppen'!$D$3:$H$20,5,FALSE)),\"\")","v":""},"","","",null,null,null,null,"","",null,{"$f":"IF(OR(F123<>\"\",G123<>\"\"),Berechnung!$H$164,D123)","v":""},"",null,3.3E-3,0,3.3E-3,"","","","",{"$f":"IF(B123=\"\",\"\",IF(B123=Finals!$X$7,Berechnung!$H$162,\"\"))","v":""},{"$f":"IF(B123=\"\",\"\",IF(B123=Finals!$X$6,Berechnung!$H$161,\"\"))","v":""},{"$f":"IF(B123=\"\",\"\",IF(B123=Finals!$X$5,Berechnung!$H$160,\"\"))","v":""},{"$f":"IF(E123=Finals!$X$7,Berechnung!$H$162,\"\")","v":90},null,null,null,null,null,null,null,null,null,null,null,null,null,null,null,null,null,null,null,null,null,null,null,null,null,null,null,{"$f":"IF(B123=\"\",\"\",IF(B123=Finals!$X$4,Berechnung!$H$159,\"\"))","v":""},{"$f":"IFERROR(IF(B123=\"\",\"\",LARGE(Y123:BF123:BF123,1)),0)","v":""},"","","","",{"$f":"IFERROR(LARGE($BI$116:$BJ$155,8),\"\")","v":""},"",null,"","","","",0,""]
[{"$f":"Spieler!A10","v":9},{"$f":"Spieler!C10","v":""},null,"","",{"$f":"IFERROR(IF(B124=\"\",\"\",VLOOKUP(B124,'2. Runde Gruppen'!$D$3:$H$20,5,FALSE)),\"\")","v":""},"","","",null,null,null,null,"","",null,{"$f":"IF(OR(F124<>\"\",G124<>\"\"),Berechnung!$H$164,D124)","v":""},"",null,3.2000000000000002E-3,{"$f":"SUM(E124:O124)","v":0},{"$f":"U124*5+T124","v":3.2000000000000002E-3},{"$f":"IF(B124=\"\",\"\",V124+R124+X124)","v":""},"","",{"$f":"IF(AND(D124=20,H124<>\"\"),$D$163,IF(AND(D124=30,H124<>\"\"),$E$163,IF(AND(D124=50,H124<>\"\"),$H$163,\"\")))","v":""},{"$f":"IF(B124=\"\",\"\",IF(B124=Finals!$X$7,Berechnung!$H$162,\"\"))","v":""},{"$f":"IF(B124=\"\",\"\",IF(B124=Finals!$X$6,Berechnung!$H$161,\"\"))","v":""},{"$f":"IF(B124=\"\",\"\",IF(B124=Finals!$X$5,Berechnung!$H$160,\"\"))","v":""},{"$f":"IF(E124=Finals!$X$7,Berechnung!$H$162,\"\")","v":90},null,null,null,null,null,null,null,null,null,null,null,null,null,null,null,null,null,null,null,null,null,null,null,null,null,null,null,{"$f":"IF(B124=\"\",\"\",IF(B124=Finals!$X$4,Berechnung!$H$159,\"\"))","v":""},{"$f":"IFERROR(IF(B124=\"\",\"\",LARGE(Y124:BF124:BF124,1)),0)","v":""},"","","","",{"$f":"IFERROR(LARGE($BI$116:$BJ$155,9),\"\")","v":""},"",null,"","","","",0,""]
[{"$f":"Spieler!A11","v":10},{"$f":"Spieler!C11","v":""},null,"",{"$f":"IF(B125=\"\",\"\",VLOOKUP(B125,$D$1:$H$83,5,FALSE))","v":""},{"$f":"IFERROR(IF(B125=\"\",\"\",VLOOKUP(B125,'2. Runde Gruppen'!$D$3:$H$20,5,FALSE)),\"\")","v":""},"","","",null,null,null,null,"","",null,{"$f":"IF(OR(F125<>\"\",G125<>\"\"),Berechnung!$H$164,D125)","v":""},"",null,3.0999999999999999E-3,0,3.0999999999999999E-3,"","","",{"$f":"IF(AND(D125=20,H125<>\"\"),$D$163,IF(AND(D125=30,H125<>\"\"),$E$163,IF(AND(D125=50,H125<>\"\"),$H$163,\"\")))","v":""},{"$f":"IF(B125=\"\",\"\",IF(B125=Finals!$X$7,Berechnung!$H$162,\"\"))","v":""},{"$f":"IF(B125=\"\",\"\",IF(B125=Finals!$X$6,Berechnung!$H$161,\"\"))","v":""},{"$f":"IF(B125=\"\",\"\",IF(B125=Finals!$X$5,Berechnung!$H$160,\"\"))","v":""},{"$f":"IF(E125=Finals!$X$7,Berechnung!$H$162,\"\")","v":90},null,null,null,null,null,null,null,null,null,null,null,null,null,null,null,null,null,null,null,null,null,null,null,null,null,null,null,{"$f":"IF(B125=\"\",\"\",IF(B125=Finals!$X$4,Berechnung!$H$159,\"\"))","v":""},{"$f":"IFERROR(IF(B125=\"\",\"\",LARGE(Y125:BF125:BF125,1)),0)","v":""},"","","","",{"$f":"IFERROR(LARGE($BI$116:$BJ$155,10),\"\")","v":""},"",null,"","","","",0,""]
[{"$f":"Spieler!A12","v":11},{"$f":"Spieler!C12","v":""},null,"","",{"$f":"IFERROR(IF(B126=\"\",\"\",VLOOKUP(B126,'2. Runde Gruppen'!$D$3:$H$20,5,FALSE)),\"\")","v":""},"","","",null,null,null,null,"","",null,{"$f":"IF(OR(F126<>\"\",G126<>\"\"),Berechnung!$H$164,D126)","v":""},"",null,3.0000000000000001E-3,0,3.0000000000000001E-3,"","","","",{"$f":"IF(B126=\"\",\"\",IF(B126=Finals!$X$7,Berechnung!$H$162,\"\"))","v":""},{"$f":"IF(B126=\"\",\"\",IF(B126=Finals!$X$6,Berechnung!$H$161,\"\"))","v":""},{"$f":"IF(B126=\"\",\"\",IF(B126=Finals!$X$5,Berechnung!$H$160,\"\"))","v":""},{"$f":"IF(E126=Finals!$X$7,Berechnung!$H$162,\"\")","v":90},null,null,null,null,null,null,null,null,null,null,null,null,null,null,null,null,null,null,null,null,null,null,null,null,null,null,null,{"$f":"IF(B126=\"\",\"\",IF(B126=Finals!$X$4,Berechnung!$H$159,\"\"))","v":""},{"$f":"IFERROR(IF(B126=\"\",\"\",LARGE(Y126:BF126:BF126,1)),0)","v":""},"","","","",{"$f":"IFERROR(LARGE($BI$116:$BJ$155,11),\"\")","v":""},"",null,"","","","",0,""]
[{"$f":"Spieler!A13","v":12},{"$f":"Spieler!C13","v":""},null,"","",{"$f":"IFERROR(IF(B127=\"\",\"\",VLOOKUP(B127,'2. Runde Gruppen'!$D$3:$H$20,5,FALSE)),\"\")","v":""},"","","",null,null,null,null,"","",null,{"$f":"IF(OR(F127<>\"\",G127<>\"\"),Berechnung!$H$164,D127)","v":""},"",null,2.8999999999999998E-3,0,2.8999999999999998E-3,"","","","",{"$f":"IF(B127=\"\",\"\",IF(B127=Finals!$X$7,Berechnung!$H$162,\"\"))","v":""},{"$f":"IF(B127=\"\",\"\",IF(B127=Finals!$X$6,Berechnung!$H$161,\"\"))","v":""},{"$f":"IF(B127=\"\",\"\",IF(B127=Finals!$X$5,Berechnung!$H$160,\"\"))","v":""},{"$f":"IF(E127=Finals!$X$7,Berechnung!$H$162,\"\")","v":90},null,null,null,null,null,null,null,null,null,null,null,null,null,null,null,null,null,null,null,null,null,null,null,null,null,null,null,{"$f":"IF(B127=\"\",\"\",IF(B127=Finals!$X$4,Berechnung!$H$159,\"\"))","v":""},{"$f":"IFERROR(IF(B127=\"\",\"\",LARGE(Y127:BF127:BF127,1)),0)","v":""},"","","","",{"$f":"IFERROR(LARGE($BI$116:$BJ$155,12),\"\")","v":""},"",null,"","","","",0,""]
[{"$f":"Spieler!A14","v":13},{"$f":"Spieler!C14","v":""},null,"","",{"$f":"IFERROR(IF(B128=\"\",\"\",VLOOKUP(B128,'2. Runde Gruppen'!$D$3:$H$20,5,FALSE)),\"\")","v":""},"","","",null,null,null,null,"","",null,{"$f":"IF(OR(F128<>\"\",G128<>\"\"),Berechnung!$H$164,D128)","v":""},"",null,2.8E-3,0,2.8E-3,"","","","",{"$f":"IF(B128=\"\",\"\",IF(B128=Finals!$X$7,Berechnung!$H$162,\"\"))","v":""},{"$f":"IF(B128=\"\",\"\",IF(B128=Finals!$X$6,Berechnung!$H$161,\"\"))","v":""},{"$f":"IF(B128=\"\",\"\",IF(B128=Finals!$X$5,Berechnung!$H$160,\"\"))","v":""},{"$f":"IF(E128=Finals!$X$7,Berechnung!$H$162,\"\")","v":90},null,null,null,null,null,null,null,null,null,null,null,null,null,null,null,null,null,null,null,null,null,null,null,null,null,null,null,{"$f":"IF(B128=\"\",\"\",IF(B128=Finals!$X$4,Berechnung!$H$159,\"\"))","v":""},{"$f":"IFERROR(IF(B128=\"\",\"\",LARGE(Y128:BF128:BF128,1)),0)","v":""},"","","","",{"$f":"IFERROR(LARGE($BI$116:$BJ$155,13),\"\")","v":""},"",null,"","","","",0,""]
[{"$f":"Spieler!A15","v":14},{"$f":"Spieler!C15","v":""},null,"","",{"$f":"IFERROR(IF(B129=\"\",\"\",VLOOKUP(B129,'2. Runde Gruppen'!$D$3:$H$20,5,FALSE)),\"\")","v":""},"","","",null,null,null,null,"","",null,{"$f":"IF(OR(F129<>\"\",G129<>\"\"),Berechnung!$H$164,D129)","v":""},"",null,2.7000000000000001E-3,0,2.7000000000000001E-3,"","","","",{"$f":"IF(B129=\"\",\"\",IF(B129=Finals!$X$7,Berechnung!$H$162,\"\"))","v":""},{"$f":"IF(B129=\"\",\"\",IF(B129=Finals!$X$6,Berechnung!$H$161,\"\"))","v":""},{"$f":"IF(B129=\"\",\"\",IF(B129=Finals!$X$5,Berechnung!$H$160,\"\"))","v":""},{"$f":"IF(E129=Finals!$X$7,Berechnung!$H$162,\"\")","v":90},null,null,null,null,null,null,null,null,null,null,null,null,null,null,null,null,null,null,null,null,null,null,null,null,null,null,null,{"$f":"IF(B129=\"\",\"\",IF(B129=Finals!$X$4,Berechnung!$H$159,\"\"))","v":""},{"$f":"IFERROR(IF(B129=\"\",\"\",LARGE(Y129:BF129:BF129,1)),0)","v":""},"","","","",{"$f":"IFERROR(LARGE($BI$116:$BJ$155,14),\"\")","v":""},"",null,"","","","",0,""]
[{"$f":"Spieler!A16","v":15},{"$f":"Spieler!C16","v":""},null,"","",{"$f":"IFERROR(IF(B130=\"\",\"\",VLOOKUP(B130,'2. Runde Gruppen'!$D$3:$H$20,5,FALSE)),\"\")","v":""},"","","",null,null,null,null,"","",null,{"$f":"IF(OR(F130<>\"\",G130<>\"\"),Berechnung!$H$164,D130)","v":""},"",null,2.5999999999999999E-3,0,2.5999999999999999E-3,"","","","",{"$f":"IF(B130=\"\",\"\",IF(B130=Finals!$X$7,Berechnung!$H$162,\"\"))","v":""},{"$f":"IF(B130=\"\",\"\",IF(B130=Finals!$X$6,Berechnung!$H$161,\"\"))","v":""},{"$f":"IF(B130=\"\",\"\",IF(B130=Finals!$X$5,Berechnung!$H$160,\"\"))","v":""},{"$f":"IF(E130=Finals!$X$7,Berechnung!$H$162,\"\")","v":90},null,null,null,null,null,null,null,null,null,null,null,null,null,null,null,null,null,null,null,null,null,null,null,null,null,null,null,{"$f":"IF(B130=\"\",\"\",IF(B130=Finals!$X$4,Berechnung!$H$159,\"\"))","v":""},{"$f":"IFERROR(IF(B130=\"\",\"\",LARGE(Y130:BF130:BF130,1)),0)","v":""},"","","","",{"$f":"IFERROR(LARGE($BI$116:$BJ$155,15),\"\")","v":""},"",null,"","","","",0,""]
[{"$f":"Spieler!A17","v":16},{"$f":"Spieler!C17","v":""},null,"","",{"$f":"IFERROR(IF(B131=\"\",\"\",VLOOKUP(B131,'2. Runde Gruppen'!$D$3:$H$20,5,FALSE)),\"\")","v":""},"","","",null,null,null,null,"","",null,{"$f":"IF(OR(F131<>\"\",G131<>\"\"),Berechnung!$H$164,D131)","v":""},"",null,2.5000000000000001E-3,0,2.5000000000000001E-3,"","","","",{"$f":"IF(B131=\"\",\"\",IF(B131=Finals!$X$7,Berechnung!$H$162,\"\"))","v":""},{"$f":"IF(B131=\"\",\"\",IF(B131=Finals!$X$6,Berechnung!$H$161,\"\"))","v":""},{"$f":"IF(B131=\"\",\"\",IF(B131=Finals!$X$5,Berechnung!$H$160,\"\"))","v":""},{"$f":"IF(E131=Finals!$X$7,Berechnung!$H$162,\"\")","v":90},null,null,null,null,null,null,null,null,null,null,null,null,null,null,null,null,null,null,null,null,null,null,null,null,null,null,null,{"$f":"IF(B131=\"\",\"\",IF(B131=Finals!$X$4,Berechnung!$H$159,\"\"))","v":""},{"$f":"IFERROR(IF(B131=\"\",\"\",LARGE(Y131:BF131:BF131,1)),0)","v":""},"",{"$f":"IFERROR(BG131+BH131,\"\")","v":""},"","",{"$f":"IFERROR(LARGE($BI$116:$BJ$155,16),\"\")","v":""},"",null,"","",{"$f":"BL131","v":""},"",0,""]
[{"$f":"Spieler!A18","v":17},{"$f":"Spieler!C18","v":""},null,"","",{"$f":"IFERROR(IF(B132=\"\",\"\",VLOOKUP(B132,'2. Runde Gruppen'!$D$3:$H$20,5,FALSE)),\"\")","v":""},"","","",null,null,null,null,"","",null,{"$f":"IF(OR(F132<>\"\",G132<>\"\"),Berechnung!$H$164,D132)","v":""},"",null,2.3999999999999998E-3,0,2.3999999999999998E-3,"","","","",{"$f":"IF(B132=\"\",\"\",IF(B132=Finals!$X$7,Berechnung!$H$162,\"\"))","v":""},{"$f":"IF(B132=\"\",\"\",IF(B132=Finals!$X$6,Berechnung!$H$161,\"\"))","v":""},{"$f":"IF(B132=\"\",\"\",IF(B132=Finals!$X$5,Berechnung!$H$160,\"\"))","v":""},{"$f":"IF(E132=Finals!$X$7,Berechnung!$H$162,\"\")","v":90},null,null,null,null,null,null,null,null,null,null,null,null,null,null,null,null,null,null,null,null,null,null,null,null,null,null,null,{"$f":"IF(B132=\"\",\"\",IF(B132=Finals!$X$4,Berechnung!$H$159,\"\"))","v":""},{"$f":"IFERROR(IF(B132=\"\",\"\",LARGE(Y132:BF132:BF132,1)),0)","v":""},"","","","",{"$f":"IFERROR(LARGE($BI$116:$BJ$155,17),\"\")","v":""},"",null,"","","","",0,""]
[{"$f":"Spieler!A19","v":18},{"$f":"Spieler!C19","v":""},null,"","",{"$f":"IFERROR(IF(B133=\"\",\"\",VLOOKUP(B133,'2. Runde Gruppen'!$D$3:$H$20,5,FALSE)),\"\")","v":""},"","","",null,null,null,null,"","",null,{"$f":"IF(OR(F133<>\"\",G133<>\"\"),Berechnung!$H$164,D133)","v":""},"",null,2.3E-3,0,2.3E-3,"","","","",{"$f":"IF(B133=\"\",\"\",IF(B133=Finals!$X$7,Berechnung!$H$162,\"\"))","v":""},{"$f":"IF(B133=\"\",\"\",IF(B133=Finals!$X$6,Berechnung!$H$161,\"\"))","v":""},{"$f":"IF(B133=\"\",\"\",IF(B133=Finals!$X$5,Berechnung!$H$160,\"\"))","v":""},{"$f":"IF(E133=Finals!$X$7,Berechnung!$H$162,\"\")","v":90},null,null,null,null,null,null,null,null,null,null,null,null,null,null,null,null,null,null,null,null,null,null,null,null,null,null,null,{"$f":"IF(B133=\"\",\"\",IF(B133=Finals!$X$4,Berechnung!$H$159,\"\"))","v":""},{"$f":"IFERROR(IF(B133=\"\",\"\",LARGE(Y133:BF133:BF133,1)),0)","v":""},"","","","",{"$f":"IFERROR(LARGE($BI$116:$BJ$155,18),\"\")","v":""},"",null,"","","","",0,""]
[{"$f":"Spieler!A20","v":19},{"$f":"Spieler!C20","v":""},null,"","",{"$f":"IFERROR(IF(B134=\"\",\"\",VLOOKUP(B134,'2. Runde Gruppen'!$D$3:$H$20,5,FALSE)),\"\")","v":""},"","","",null,null,null,null,"","",null,{"$f":"IF(OR(F134<>\"\",G134<>\"\"),Berechnung!$H$164,D134)","v":""},"",null,2.2000000000000001E-3,0,2.2000000000000001E-3,"","","","",{"$f":"IF(B134=\"\",\"\",IF(B134=Finals!$X$7,Berechnung!$H$162,\"\"))","v":""},{"$f":"IF(B134=\"\",\"\",IF(B134=Finals!$X$6,Berechnung!$H$161,\"\"))","v":""},{"$f":"IF(B134=\"\",\"\",IF(B134=Finals!$X$5,Berechnung!$H$160,\"\"))","v":""},{"$f":"IF(E134=Finals!$X$7,Berechnung!$H$162,\"\")","v":90},null,null,null,null,null,null,null,null,null,null,null,null,null,null,null,null,null,null,null,null,null,null,null,null,null,null,null,{"$f":"IF(B134=\"\",\"\",IF(B134=Finals!$X$4,Berechnung!$H$159,\"\"))","v":""},{"$f":"IFERROR(IF(B134=\"\",\"\",LARGE(Y134:BF134:BF134,1)),0)","v":""},"","","","",{"$f":"IFERROR(LARGE($BI$116:$BJ$155,19),\"\")","v":""},"",null,"","","","",0,""]
[{"$f":"Spieler!A21","v":20},{"$f":"Spieler!C21","v":""},null,"","",{"$f":"IFERROR(IF(B135=\"\",\"\",VLOOKUP(B135,'2. Runde Gruppen'!$D$3:$H$20,5,FALSE)),\"\")","v":""},"","","",null,null,null,null,"","",null,{"$f":"IF(OR(F135<>\"\",G135<>\"\"),Berechnung!$H$164,D135)","v":""},"",null,2.0999999999999999E-3,0,2.0999999999999999E-3,"","",{"$f":"IF(AND(D135=30,G135<>\"\"),$E$164,IF(AND(D135=50,G135<>\"\"),$H$164,\"\"))","v":""},"",{"$f":"IF(B135=\"\",\"\",IF(B135=Finals!$X$7,Berechnung!$H$162,\"\"))","v":""},{"$f":"IF(B135=\"\",\"\",IF(B135=Finals!$X$6,Berechnung!$H$161,\"\"))","v":""},{"$f":"IF(B135=\"\",\"\",IF(B135=Finals!$X$5,Berechnung!$H$160,\"\"))","v":""},{"$f":"IF(E135=Finals!$X$7,Berechnung!$H$162,\"\")","v":90},null,null,null,null,null,null,null,null,null,null,null,null,null,null,null,null,null,null,null,null,null,null,null,null,null,null,null,{"$f":"IF(B135=\"\",\"\",IF(B135=Finals!$X$4,Berechnung!$H$159,\"\"))","v":""},{"$f":"IFERROR(IF(B135=\"\",\"\",LARGE(Y135:BF135:BF135,1)),0)","v":""},"","","","",{"$f":"IFERROR(LARGE($BI$116:$BJ$155,20),\"\")","v":""},"",null,"","","","",0,""]
[{"$f":"Spieler!A22","v":21},{"$f":"Spieler!C22","v":""},null,"","",{"$f":"IFERROR(IF(B136=\"\",\"\",VLOOKUP(B136,'2. Runde Gruppen'!$D$3:$H$20,5,FALSE)),\"\")","v":""},{"$f":"IFERROR(VLOOKUP(B136,$D$90:$E$113,2,FALSE),\"\")","v":""},"","",null,null,null,null,"","",null,{"$f":"IF(OR(F136<>\"\",G136<>\"\"),Berechnung!$H$164,D136)","v":""},"",null,1.9999999999999901E-3,0,1.9999999999999901E-3,"","",{"$f":"IF(AND(D136=30,G136<>\"\"),$E$164,IF(AND(D136=50,G136<>\"\"),$H$164,\"\"))","v":""},"",{"$f":"IF(B136=\"\",\"\",IF(B136=Finals!$X$7,Berechnung!$H$162,\"\"))","v":""},{"$f":"IF(B136=\"\",\"\",IF(B136=Finals!$X$6,Berechnung!$H$161,\"\"))","v":""},{"$f":"IF(B136=\"\",\"\",IF(B136=Finals!$X$5,Berechnung!$H$160,\"\"))","v":""},{"$f":"IF(E136=Finals!$X$7,Berechnung!$H$162,\"\")","v":90},null,null,null,null,null,null,null,null,null,null,null,null,null,null,null,null,null,null,null,null,null,null,null,null,null,null,null,{"$f":"IF(B136=\"\",\"\",IF(B136=Finals!$X$4,Berechnung!$H$159,\"\"))","v":""},{"$f":"IFERROR(IF(B136=\"\",\"\",LARGE(Y136:BF136:BF136,1)),0)","v":""},"",{"$f":"IFERROR(BG136+BH136,\"\")","v":""},"","",{"$f":"IFERROR(LARGE($BI$116:$BJ$155,21),\"\")","v":""},"",null,"","","","",0,""]
[{"$f":"Spieler!A23","v":22},{"$f":"Spieler!C23","v":""},null,"","",{"$f":"IFERROR(IF(B137=\"\",\"\",VLOOKUP(B137,'2. Runde Gruppen'!$D$3:$H$20,5,FALSE)),\"\")","v":""},"","","",null,null,null,null,"","",null,{"$f":"IF(OR(F137<>\"\",G137<>\"\"),Berechnung!$H$164,D137)","v":""},"",null,1.89999999999999E-3,0,1.89999999999999E-3,"","","","",{"$f":"IF(B137=\"\",\"\",IF(B137=Finals!$X$7,Berechnung!$H$162,\"\"))","v":""},{"$f":"IF(B137=\"\",\"\",IF(B137=Finals!$X$6,Berechnung!$H$161,\"\"))","v":""},{"$f":"IF(B137=\"\",\"\",IF(B137=Finals!$X$5,Berechnung!$H$160,\"\"))","v":""},{"$f":"IF(E137=Finals!$X$7,Berechnung!$H$162,\"\")","v":90},null,null,null,null,null,null,null,null,null,null,null,null,null,null,null,null,null,null,null,null,null,null,null,null,null,null,null,{"$f":"IF(B137=\"\",\"\",IF(B137=Finals!$X$4,Berechnung!$H$159,\"\"))","v":""},{"$f":"IFERROR(IF(B137=\"\",\"\",LARGE(Y137:BF137:BF137,1)),0)","v":""},"","","","",{"$f":"IFERROR(LARGE($BI$116:$BJ$155,22),\"\")","v":""},"",null,"","","","",0,""]
[{"$f":"Spieler!A24","v":23},{"$f":"Spieler!C24","v":""},null,"","",{"$f":"IFERROR(IF(B138=\"\",\"\",VLOOKUP(B138,'2. Runde Gruppen'!$D$3:$H$20,5,FALSE)),\"\")","v":""},"","","",null,null,null,null,"","",null,{"$f":"IF(OR(F138<>\"\",G138<>\"\"),Berechnung!$H$164,D138)","v":""},"",null,1.79999999999999E-3,0,1.79999999999999E-3,"","","","",{"$f":"IF(B138=\"\",\"\",IF(B138=Finals!$X$7,Berechnung!$H$162,\"\"))","v":""},{"$f":"IF(B138=\"\",\"\",IF(B138=Finals!$X$6,Berechnung!$H$161,\"\"))","v":""},{"$f":"IF(B138=\"\",\"\",IF(B138=Finals!$X$5,Berechnung!$H$160,\"\"))","v":""},{"$f":"IF(E138=Finals!$X$7,Berechnung!$H$162,\"\")","v":90},null,null,null,null,null,null,null,null,null,null,null,null,null,null,null,null,null,null,null,null,null,null,null,null,null,null,null,{"$f":"IF(B138=\"\",\"\",IF(B138=Finals!$X$4,Berechnung!$H$159,\"\"))","v":""},{"$f":"IFERROR(IF(B138=\"\",\"\",LARGE(Y138:BF138:BF138,1)),0)","v":""},"","","","",{"$f":"IFERROR(LARGE($BI$116:$BJ$155,23),\"\")","v":""},"",null,"","","","",0,""]
[{"$f":"Spieler!A25","v":24},{"$f":"Spieler!C25","v":""},null,"","",{"$f":"IFERROR(IF(B139=\"\",\"\",VLOOKUP(B139,'2. Runde Gruppen'!$D$3:$H$20,5,FALSE)),\"\")","v":""},"","","",null,null,null,null,"","",null,{"$f":"IF(OR(F139<>\"\",G139<>\"\"),Berechnung!$H$164,D139)","v":""},"",null,1.6999999999999899E-3,0,1.6999999999999899E-3,"","","","",{"$f":"IF(B139=\"\",\"\",IF(B139=Finals!$X$7,Berechnung!$H$162,\"\"))","v":""},{"$f":"IF(B139=\"\",\"\",IF(B139=Finals!$X$6,Berechnung!$H$161,\"\"))","v":""},{"$f":"IF(B139=\"\",\"\",IF(B139=Finals!$X$5,Berechnung!$H$160,\"\"))","v":""},{"$f":"IF(E139=Finals!$X$7,Berechnung!$H$162,\"\")","v":90},null,null,null,null,null,null,null,null,null,null,null,null,null,null,null,null,null,null,null,null,null,null,null,null,null,null,null,{"$f":"IF(B139=\"\",\"\",IF(B139=Finals!$X$4,Berechnung!$H$159,\"\"))","v":""},{"$f":"IFERROR(IF(B139=\"\",\"\",LARGE(Y139:BF139:BF139,1)),0)","v":""},"","","","",{"$f":"IFERROR(LARGE($BI$116:$BJ$155,24),\"\")","v":""},"",null,"","","","",0,""]
[{"$f":"Spieler!A26","v":25},{"$f":"Spieler!C26","v":""},null,"",{"$f":"IF(B140=\"\",\"\",VLOOKUP(B140,$D$1:$H$83,5,FALSE))","v":""},{"$f":"IFERROR(IF(B140=\"\",\"\",VLOOKUP(B140,'2. Runde Gruppen'!$D$3:$H$20,5,FALSE)),\"\")","v":""},"","","",null,null,null,null,"","",null,{"$f":"IF(OR(F140<>\"\",G140<>\"\"),Berechnung!$H$164,D140)","v":""},"",null,1.5999999999999901E-3,0,1.5999999999999901E-3,"","","","",{"$f":"IF(B140=\"\",\"\",IF(B140=Finals!$X$7,Berechnung!$H$162,\"\"))","v":""},{"$f":"IF(B140=\"\",\"\",IF(B140=Finals!$X$6,Berechnung!$H$161,\"\"))","v":""},{"$f":"IF(B140=\"\",\"\",IF(B140=Finals!$X$5,Berechnung!$H$160,\"\"))","v":""},{"$f":"IF(E140=Finals!$X$7,Berechnung!$H$162,\"\")","v":90},null,null,null,null,null,null,null,null,null,null,null,null,null,null,null,null,null,null,null,null,null,null,null,null,null,null,null,{"$f":"IF(B140=\"\",\"\",IF(B140=Finals!$X$4,Berechnung!$H$159,\"\"))","v":""},{"$f":"IFERROR(IF(B140=\"\",\"\",LARGE(Y140:BF140:BF140,1)),0)","v":""},"","","",{"$f":"IF(B140=\"\",\"\",A140)","v":""},{"$f":"IFERROR(LARGE($BI$116:$BJ$155,25),\"\")","v":""},"",null,"","","","",0,""]
[{"$f":"Spieler!A27","v":26},{"$f":"Spieler!C27","v":""},null,"",{"$f":"IF(B141=\"\",\"\",VLOOKUP(B141,$D$1:$H$83,5,FALSE))","v":""},{"$f":"IFERROR(IF(B141=\"\",\"\",VLOOKUP(B141,'2. Runde Gruppen'!$D$3:$H$20,5,FALSE)),\"\")","v":""},"","","",null,null,null,null,"","",null,{"$f":"IF(OR(F141<>\"\",G141<>\"\"),Berechnung!$H$164,D141)","v":""},{"$f":"IF(Q141<>\"\",Q141,D141)","v":""},null,1.4999999999999901E-3,0,1.4999999999999901E-3,"","","","",{"$f":"IF(B141=\"\",\"\",IF(B141=Finals!$X$7,Berechnung!$H$162,\"\"))","v":""},{"$f":"IF(B141=\"\",\"\",IF(B141=Finals!$X$6,Berechnung!$H$161,\"\"))","v":""},{"$f":"IF(B141=\"\",\"\",IF(B141=Finals!$X$5,Berechnung!$H$160,\"\"))","v":""},{"$f":"IF(E141=Finals!$X$7,Berechnung!$H$162,\"\")","v":90},null,null,null,null,null,null,null,null,null,null,null,null,null,null,null,null,null,null,null,null,null,null,null,null,null,null,null,{"$f":"IF(B141=\"\",\"\",IF(B141=Finals!$X$4,Berechnung!$H$159,\"\"))","v":""},{"$f":"IFERROR(IF(B141=\"\",\"\",LARGE(Y141:BF141:BF141,1)),0)","v":""},"","","",{"$f":"IF(B141=\"\",\"\",A141)","v":""},{"$f":"IFERROR(LARGE($BI$116:$BJ$155,26),\"\")","v":""},"",null,"","","","",0,""]
[{"$f":"Spieler!A28","v":27},{"$f":"Spieler!C28","v":""},null,"","",{"$f":"IFERROR(IF(B142=\"\",\"\",VLOOKUP(B142,'2. Runde Gruppen'!$D$3:$H$20,5,FALSE)),\"\")","v":""},"","","",null,null,null,null,"","",null,{"$f":"IF(OR(F142<>\"\",G142<>\"\"),Berechnung!$H$164,D142)","v":""},"",null,1.39999999999999E-3,0,1.39999999999999E-3,"","","","",{"$f":"IF(B142=\"\",\"\",IF(B142=Finals!$X$7,Berechnung!$H$162,\"\"))","v":""},{"$f":"IF(B142=\"\",\"\",IF(B142=Finals!$X$6,Berechnung!$H$161,\"\"))","v":""},{"$f":"IF(B142=\"\",\"\",IF(B142=Finals!$X$5,Berechnung!$H$160,\"\"))","v":""},{"$f":"IF(E142=Finals!$X$7,Berechnung!$H$162,\"\")","v":90},null,null,null,null,null,null,null,null,null,null,null,null,null,null,null,null,null,null,null,null,null,null,null,null,null,null,null,{"$f":"IF(B142=\"\",\"\",IF(B142=Finals!$X$4,Berechnung!$H$159,\"\"))","v":""},{"$f":"IFERROR(IF(B142=\"\",\"\",LARGE(Y142:BF142:BF142,1)),0)","v":""},"","","","",{"$f":"IFERROR(LARGE($BI$116:$BJ$155,27),\"\")","v":""},"",null,"","","","",0,""]
[{"$f":"Spieler!A29","v":28},{"$f":"Spieler!C29","v":""},null,"","",{"$f":"IFERROR(IF(B143=\"\",\"\",VLOOKUP(B143,'2. Runde Gruppen'!$D$3:$H$20,5,FALSE)),\"\")","v":""},"","","",null,null,null,null,"","",null,{"$f":"IF(OR(F143<>\"\",G143<>\"\"),Berechnung!$H$164,D143)","v":""},"",null,1.29999999999999E-3,0,1.29999999999999E-3,"","","","",{"$f":"IF(B143=\"\",\"\",IF(B143=Finals!$X$7,Berechnung!$H$162,\"\"))","v":""},{"$f":"IF(B143=\"\",\"\",IF(B143=Finals!$X$6,Berechnung!$H$161,\"\"))","v":""},{"$f":"IF(B143=\"\",\"\",IF(B143=Finals!$X$5,Berechnung!$H$160,\"\"))","v":""},{"$f":"IF(E143=Finals!$X$7,Berechnung!$H$162,\"\")","v":90},null,null,null,null,null,null,null,null,null,null,null,null,null,null,null,null,null,null,null,null,null,null,null,null,null,null,null,{"$f":"IF(B143=\"\",\"\",IF(B143=Finals!$X$4,Berechnung!$H$159,\"\"))","v":""},{"$f":"IFERROR(IF(B143=\"\",\"\",LARGE(Y143:BF143:BF143,1)),0)","v":""},"","","","",{"$f":"IFERROR(LARGE($BI$116:$BJ$155,28),\"\")","v":""},"",null,"","","","",0,""]
[{"$f":"Spieler!A30","v":29},{"$f":"Spieler!C30","v":""},null,"","",{"$f":"IFERROR(IF(B144=\"\",\"\",VLOOKUP(B144,'2. Runde Gruppen'!$D$3:$H$20,5,FALSE)),\"\")","v":""},"","","",null,null,null,null,"","",null,{"$f":"IF(OR(F144<>\"\",G144<>\"\"),Berechnung!$H$164,D144)","v":""},"",null,1.1999999999999899E-3,0,1.1999999999999899E-3,"","","","",{"$f":"IF(B144=\"\",\"\",IF(B144=Finals!$X$7,Berechnung!$H$162,\"\"))","v":""},{"$f":"IF(B144=\"\",\"\",IF(B144=Finals!$X$6,Berechnung!$H$161,\"\"))","v":""},{"$f":"IF(B144=\"\",\"\",IF(B144=Finals!$X$5,Berechnung!$H$160,\"\"))","v":""},{"$f":"IF(E144=Finals!$X$7,Berechnung!$H$162,\"\")","v":90},null,null,null,null,null,null,null,null,null,null,null,null,null,null,null,null,null,null,null,null,null,null,null,null,null,null,null,{"$f":"IF(B144=\"\",\"\",IF(B144=Finals!$X$4,Berechnung!$H$159,\"\"))","v":""},{"$f":"IFERROR(IF(B144=\"\",\"\",LARGE(Y144:BF144:BF144,1)),0)","v":""},"","","","",{"$f":"IFERROR(LARGE($BI$116:$BJ$155,29),\"\")","v":""},"",null,"","","","",0,""]
[{"$f":"Spieler!A31","v":30},{"$f":"Spieler!C31","v":""},null,"","",{"$f":"IFERROR(IF(B145=\"\",\"\",VLOOKUP(B145,'2. Runde Gruppen'!$D$3:$H$20,5,FALSE)),\"\")","v":""},"","","",null,null,null,null,"","",null,{"$f":"IF(OR(F145<>\"\",G145<>\"\"),Berechnung!$H$164,D145)","v":""},"",null,1.0999999999999901E-3,0,1.0999999999999901E-3,"","","","",{"$f":"IF(B145=\"\",\"\",IF(B145=Finals!$X$7,Berechnung!$H$162,\"\"))","v":""},{"$f":"IF(B145=\"\",\"\",IF(B145=Finals!$X$6,Berechnung!$H$161,\"\"))","v":""},{"$f":"IF(B145=\"\",\"\",IF(B145=Finals!$X$5,Berechnung!$H$160,\"\"))","v":""},{"$f":"IF(E145=Finals!$X$7,Berechnung!$H$162,\"\")","v":90},null,null,null,null,null,null,null,null,null,null,null,null,null,null,null,null,null,null,null,null,null,null,null,null,null,null,null,{"$f":"IF(B145=\"\",\"\",IF(B145=Finals!$X$4,Berechnung!$H$159,\"\"))","v":""},{"$f":"IFERROR(IF(B145=\"\",\"\",LARGE(Y145:BF145:BF145,1)),0)","v":""},"","","","",{"$f":"IFERROR(LARGE($BI$116:$BJ$155,30),\"\")","v":""},"",null,"","","","",0,""]
[{"$f":"Spieler!A32","v":31},{"$f":"Spieler!C32","v":""},null,"","",{"$f":"IFERROR(IF(B146=\"\",\"\",VLOOKUP(B146,'2. Runde Gruppen'!$D$3:$H$20,5,FALSE)),\"\")","v":""},"","","",null,null,null,null,"","",null,{"$f":"IF(OR(F146<>\"\",G146<>\"\"),Berechnung!$H$164,D146)","v":""},"",null,9.9999999999999005E-4,0,9.9999999999999005E-4,"","","","",{"$f":"IF(B146=\"\",\"\",IF(B146=Finals!$X$7,Berechnung!$H$162,\"\"))","v":""},{"$f":"IF(B146=\"\",\"\",IF(B146=Finals!$X$6,Berechnung!$H$161,\"\"))","v":""},{"$f":"IF(B146=\"\",\"\",IF(B146=Finals!$X$5,Berechnung!$H$160,\"\"))","v":""},{"$f":"IF(E146=Finals!$X$7,Berechnung!$H$162,\"\")","v":90},null,null,null,null,null,null,null,null,null,null,null,null,null,null,null,null,null,null,null,null,null,null,null,null,null,null,null,{"$f":"IF(B146=\"\",\"\",IF(B146=Finals!$X$4,Berechnung!$H$159,\"\"))","v":""},{"$f":"IFERROR(IF(B146=\"\",\"\",LARGE(Y146:BF146:BF146,1)),0)","v":""},"","","","",{"$f":"IFERROR(LARGE($BI$116:$BJ$155,31),\"\")","v":""},"",null,"","","","",0,""]
[{"$f":"Spieler!A33","v":32},{"$f":"Spieler!C33","v":""},null,"","",{"$f":"IFERROR(IF(B147=\"\",\"\",VLOOKUP(B147,'2. Runde Gruppen'!$D$3:$H$20,5,FALSE)),\"\")","v":""},"","","",null,null,null,null,"","",null,{"$f":"IF(OR(F147<>\"\",G147<>\"\"),Berechnung!$H$164,D147)","v":""},"",null,8.9999999999999E-4,0,8.9999999999999E-4,"","","","",{"$f":"IF(B147=\"\",\"\",IF(B147=Finals!$X$7,Berechnung!$H$162,\"\"))","v":""},{"$f":"IF(B147=\"\",\"\",IF(B147=Finals!$X$6,Berechnung!$H$161,\"\"))","v":""},{"$f":"IF(B147=\"\",\"\",IF(B147=Finals!$X$5,Berechnung!$H$160,\"\"))","v":""},{"$f":"IF(E147=Finals!$X$7,Berechnung!$H$162,\"\")","v":90},null,null,null,null,null,null,null,null,null,null,null,null,null,null,null,null,null,null,null,null,null,null,null,null,null,null,null,{"$f":"IF(B147=\"\",\"\",IF(B147=Finals!$X$4,Berechnung!$H$159,\"\"))","v":""},{"$f":"IFERROR(IF(B147=\"\",\"\",LARGE(Y147:BF147:BF147,1)),0)","v":""},"","","","",{"$f":"IFERROR(LARGE($BI$116:$BJ$155,32),\"\")","v":""},{"$f":"IF(BJ147=\"\",\"\",VLOOKUP(BL147,$BI$116:$BJ$155,2,FALSE))","v":""},null,"","","","",0,""]
[{"$f":"Spieler!A34","v":33},{"$f":"Spieler!C34","v":""},null,"","",{"$f":"IFERROR(IF(B148=\"\",\"\",VLOOKUP(B148,'2. Runde Gruppen'!$D$3:$H$20,5,FALSE)),\"\")","v":""},"","","",null,null,null,null,"","",null,{"$f":"IF(OR(F148<>\"\",G148<>\"\"),Berechnung!$H$164,D148)","v":""},"",null,7.9999999999998996E-4,0,7.9999999999998996E-4,"","","","",{"$f":"IF(B148=\"\",\"\",IF(B148=Finals!$X$7,Berechnung!$H$162,\"\"))","v":""},{"$f":"IF(B148=\"\",\"\",IF(B148=Finals!$X$6,Berechnung!$H$161,\"\"))","v":""},{"$f":"IF(B148=\"\",\"\",IF(B148=Finals!$X$5,Berechnung!$H$160,\"\"))","v":""},{"$f":"IF(E148=Finals!$X$7,Berechnung!$H$162,\"\")","v":90},null,null,null,null,null,null,null,null,null,null,null,null,null,null,null,null,null,null,null,null,null,null,null,null,null,null,null,{"$f":"IF(B148=\"\",\"\",IF(B148=Finals!$X$4,Berechnung!$H$159,\"\"))","v":""},{"$f":"IFERROR(IF(B148=\"\",\"\",LARGE(Y148:BF148:BF148,1)),0)","v":""},"","","","",{"$f":"IFERROR(LARGE($BI$116:$BJ$155,33),\"\")","v":""},{"$f":"IF(BJ148=\"\",\"\",VLOOKUP(BL148,$BI$116:$BJ$155,2,FALSE))","v":""},null,"","","","",0,""]
[{"$f":"Spieler!A35","v":34},{"$f":"Spieler!C35","v":""},null,"","",{"$f":"IFERROR(IF(B149=\"\",\"\",VLOOKUP(B149,'2. Runde Gruppen'!$D$3:$H$20,5,FALSE)),\"\")","v":""},"","","",null,null,null,null,"","",null,{"$f":"IF(OR(F149<>\"\",G149<>\"\"),Berechnung!$H$164,D149)","v":""},"",null,6.9999999999999002E-4,0,6.9999999999999002E-4,"","","","",{"$f":"IF(B149=\"\",\"\",IF(B149=Finals!$X$7,Berechnung!$H$162,\"\"))","v":""},{"$f":"IF(B149=\"\",\"\",IF(B149=Finals!$X$6,Berechnung!$H$161,\"\"))","v":""},{"$f":"IF(B149=\"\",\"\",IF(B149=Finals!$X$5,Berechnung!$H$160,\"\"))","v":""},{"$f":"IF(E149=Finals!$X$7,Berechnung!$H$162,\"\")","v":90},null,null,null,null,null,null,null,null,null,null,null,null,null,null,null,null,null,null,null,null,null,null,null,null,null,null,null,{"$f":"IF(B149=\"\",\"\",IF(B149=Finals!$X$4,Berechnung!$H$159,\"\"))","v":""},{"$f":"IFERROR(IF(B149=\"\",\"\",LARGE(Y149:BF149:BF149,1)),0)","v":""},"","","","",{"$f":"IFERROR(LARGE($BI$116:$BJ$155,34),\"\")","v":""},"",null,"","","","",0,""]
[{"$f":"Spieler!A36","v":35},{"$f":"Spieler!C36","v":""},null,"","",{"$f":"IFERROR(IF(B150=\"\",\"\",VLOOKUP(B150,'2. Runde Gruppen'!$D$3:$H$20,5,FALSE)),\"\")","v":""},"","","",null,null,null,null,"","",null,{"$f":"IF(OR(F150<>\"\",G150<>\"\"),Berechnung!$H$164,D150)","v":""},"",null,5.9999999999998997E-4,0,5.9999999999998997E-4,"","","","",{"$f":"IF(B150=\"\",\"\",IF(B150=Finals!$X$7,Berechnung!$H$162,\"\"))","v":""},{"$f":"IF(B150=\"\",\"\",IF(B150=Finals!$X$6,Berechnung!$H$161,\"\"))","v":""},{"$f":"IF(B150=\"\",\"\",IF(B150=Finals!$X$5,Berechnung!$H$160,\"\"))","v":""},{"$f":"IF(E150=Finals!$X$7,Berechnung!$H$162,\"\")","v":90},null,null,null,null,null,null,null,null,null,null,null,null,null,null,null,null,null,null,null,null,null,null,null,null,null,null,null,{"$f":"IF(B150=\"\",\"\",IF(B150=Finals!$X$4,Berechnung!$H$159,\"\"))","v":""},{"$f":"IFERROR(IF(B150=\"\",\"\",LARGE(Y150:BF150:BF150,1)),0)","v":""},"","","","",{"$f":"IFERROR(LARGE($BI$116:$BJ$155,35),\"\")","v":""},"",null,"","","","",0,""]
[{"$f":"Spieler!A37","v":36},{"$f":"Spieler!C37","v":""},null,"","",{"$f":"IFERROR(IF(B151=\"\",\"\",VLOOKUP(B151,'2. Runde Gruppen'!$D$3:$H$20,5,FALSE)),\"\")","v":""},"","","",null,null,null,null,"","",null,{"$f":"IF(OR(F151<>\"\",G151<>\"\"),Berechnung!$H$164,D151)","v":""},"",null,4.9999999999999004E-4,0,4.9999999999999004E-4,"","","","",{"$f":"IF(B151=\"\",\"\",IF(B151=Finals!$X$7,Berechnung!$H$162,\"\"))","v":""},{"$f":"IF(B151=\"\",\"\",IF(B151=Finals!$X$6,Berechnung!$H$161,\"\"))","v":""},{"$f":"IF(B151=\"\",\"\",IF(B151=Finals!$X$5,Berechnung!$H$160,\"\"))","v":""},{"$f":"IF(E151=Finals!$X$7,Berechnung!$H$162,\"\")","v":90},null,null,null,null,null,null,null,null,null,null,null,null,null,null,null,null,null,null,null,null,null,null,null,null,null,null,null,{"$f":"IF(B151=\"\",\"\",IF(B151=Finals!$X$4,Berechnung!$H$159,\"\"))","v":""},{"$f":"IFERROR(IF(B151=\"\",\"\",LARGE(Y151:BF151:BF151,1)),0)","v":""},"","","","",{"$f":"IFERROR(LARGE($BI$116:$BJ$155,36),\"\")","v":""},"",null,"","","","",0,""]
[{"$f":"Spieler!A38","v":37},{"$f":"Spieler!C38","v":""},null,"","",{"$f":"IFERROR(IF(B152=\"\",\"\",VLOOKUP(B152,'2. Runde Gruppen'!$D$3:$H$20,5,FALSE)),\"\")","v":""},"","","",null,null,null,null,"","",null,{"$f":"IF(OR(F152<>\"\",G152<>\"\"),Berechnung!$H$164,D152)","v":""},"",null,3.9999999999998999E-4,0,3.9999999999998999E-4,"","","","",{"$f":"IF(B152=\"\",\"\",IF(B152=Finals!$X$7,Berechnung!$H$162,\"\"))","v":""},{"$f":"IF(B152=\"\",\"\",IF(B152=Finals!$X$6,Berechnung!$H$161,\"\"))","v":""},{"$f":"IF(B152=\"\",\"\",IF(B152=Finals!$X$5,Berechnung!$H$160,\"\"))","v":""},{"$f":"IF(E152=Finals!$X$7,Berechnung!$H$162,\"\")","v":90},null,null,null,null,null,null,null,null,null,null,null,null,null,null,null,null,null,null,null,null,null,null,null,null,null,null,null,{"$f":"IF(B152=\"\",\"\",IF(B152=Finals!$X$4,Berechnung!$H$159,\"\"))","v":""},{"$f":"IFERROR(IF(B152=\"\",\"\",LARGE(Y152:BF152:BF152,1)),0)","v":""},"","","","",{"$f":"IFERROR(LARGE($BI$116:$BJ$155,37),\"\")","v":""},"",null,"","","","",0,""]
[{"$f":"Spieler!A39","v":38},{"$f":"Spieler!C39","v":""},null,"","",{"$f":"IFERROR(IF(B153=\"\",\"\",VLOOKUP(B153,'2. Runde Gruppen'!$D$3:$H$20,5,FALSE)),\"\")","v":""},"","","",null,null,null,null,"","",null,{"$f":"IF(OR(F153<>\"\",G153<>\"\"),Berechnung!$H$164,D153)","v":""},"",null,2.9999999999999E-4,0,2.9999999999999E-4,"","","","",{"$f":"IF(B153=\"\",\"\",IF(B153=Finals!$X$7,Berechnung!$H$162,\"\"))","v":""},{"$f":"IF(B153=\"\",\"\",IF(B153=Finals!$X$6,Berechnung!$H$161,\"\"))","v":""},{"$f":"IF(B153=\"\",\"\",IF(B153=Finals!$X$5,Berechnung!$H$160,\"\"))","v":""},{"$f":"IF(E153=Finals!$X$7,Berechnung!$H$162,\"\")","v":90},null,null,null,null,null,null,null,null,null,null,null,null,null,null,null,null,null,null,null,null,null,null,null,null,null,null,null,{"$f":"IF(B153=\"\",\"\",IF(B153=Finals!$X$4,Berechnung!$H$159,\"\"))","v":""},{"$f":"IFERROR(IF(B153=\"\",\"\",LARGE(Y153:BF153:BF153,1)),0)","v":""},"","","","",{"$f":"IFERROR(LARGE($BI$116:$BJ$155,38),\"\")","v":""},"",null,"","","","",0,""]
[{"$f":"Spieler!A40","v":39},{"$f":"Spieler!C40","v":""},null,"","",{"$f":"IFERROR(IF(B154=\"\",\"\",VLOOKUP(B154,'2. Runde Gruppen'!$D$3:$H$20,5,FALSE)),\"\")","v":""},"","","",null,null,null,null,"","",null,{"$f":"IF(OR(F154<>\"\",G154<>\"\"),Berechnung!$H$164,D154)","v":""},"",null,1.9999999999999001E-4,0,1.9999999999999001E-4,"","","","",{"$f":"IF(B154=\"\",\"\",IF(B154=Finals!$X$7,Berechnung!$H$162,\"\"))","v":""},{"$f":"IF(B154=\"\",\"\",IF(B154=Finals!$X$6,Berechnung!$H$161,\"\"))","v":""},{"$f":"IF(B154=\"\",\"\",IF(B154=Finals!$X$5,Berechnung!$H$160,\"\"))","v":""},{"$f":"IF(E154=Finals!$X$7,Berechnung!$H$162,\"\")","v":90},null,null,null,null,null,null,null,null,null,null,null,null,null,null,null,null,null,null,null,null,null,null,null,null,null,null,null,{"$f":"IF(B154=\"\",\"\",IF(B154=Finals!$X$4,Berechnung!$H$159,\"\"))","v":""},{"$f":"IFERROR(IF(B154=\"\",\"\",LARGE(Y154:BF154:BF154,1)),0)","v":""},"","","","",{"$f":"IFERROR(LARGE($BI$116:$BJ$155,39),\"\")","v":""},"",null,"","","","",0,""]
[{"$f":"Spieler!A41","v":40},{"$f":"Spieler!C41","v":""},null,"","",{"$f":"IFERROR(IF(B155=\"\",\"\",VLOOKUP(B155,'2. Runde Gruppen'!$D$3:$H$20,5,FALSE)),\"\")","v":""},"","","",null,null,null,null,"","",null,{"$f":"IF(OR(F155<>\"\",G155<>\"\"),Berechnung!$H$164,D155)","v":""},"",null,9.9999999999990301E-5,0,9.9999999999990301E-5,"","","","",{"$f":"IF(B155=\"\",\"\",IF(B155=Finals!$X$7,Berechnung!$H$162,\"\"))","v":""},{"$f":"IF(B155=\"\",\"\",IF(B155=Finals!$X$6,Berechnung!$H$161,\"\"))","v":""},{"$f":"IF(B155=\"\",\"\",IF(B155=Finals!$X$5,Berechnung!$H$160,\"\"))","v":""},{"$f":"IF(E155=Finals!$X$7,Berechnung!$H$162,\"\")","v":90},null,null,null,null,null,null,null,null,null,null,null,null,null,null,null,null,null,null,null,null,null,null,null,null,null,null,null,{"$f":"IF(B155=\"\",\"\",IF(B155=Finals!$X$4,Berechnung!$H$159,\"\"))","v":""},{"$f":"IFERROR(IF(B155=\"\",\"\",LARGE(Y155:BF155:BF155,1)),0)","v":""},"","","","",{"$f":"IFERROR(LARGE($BI$116:$BJ$155,40),\"\")","v":""},"",null,"","","","",0,""]
[]
[]
[null,"Platzierung",null,"12-15 TN","16-23 TN","24-40 TN"]
[null,"1. Platz",null,{"$f":"Spieler!S18","v":150},{"$f":"Spieler!T18","v":250},{"$f":"Spieler!AA18","v":350},null,{"$f":"IF($BH$1<16,D159,IF(AND($BH$1>15,$BH$1<24),E159,IF($BH$1>23,F159)))","v":150}]
[null,"2. Platz",null,{"$f":"Spieler!S19","v":120},{"$f":"Spieler!T19","v":200},{"$f":"Spieler!AA19","v":300},null,{"$f":"IF($BH$1<16,D160,IF(AND($BH$1>15,$BH$1<24),E160,IF($BH$1>23,F160)))","v":120}]
[null,"3. Platz",null,{"$f":"Spieler!S20","v":90},{"$f":"Spieler!T20","v":140},{"$f":"Spieler!AA20","v":230},null,90]
[null,"4. Platz",null,{"$f":"Spieler!S21","v":90},{"$f":"Spieler!T21","v":140},{"$f":"Spieler!AA21","v":230},null,{"$f":"IF($BH$1<16,D162,IF(AND($BH$1>15,$BH$1<24),E162,IF($BH$1>23,F162)))","v":90}]
[null,"Viertelfinale",null,{"$f":"Spieler!S22","v":50},{"$f":"Spieler!T22","v":100},{"$f":"Spieler!AA22","v":150},null,50]
[null,"2. Runde (Gr. o. AF)",null,{"$f":"Spieler!S23","v":"-"},{"$f":"Spieler!T23","v":60},{"$f":"Spieler!AA23","v":100},null,"-"]
[null,"Teilnahme",null,{"$f":"Spieler!S24","v":20},{"$f":"Spieler!T24","v":30},{"$f":"Spieler!AA24","v":50},null,20]
[]
[]
[null,null,null,null,"R1",null,"R2",null,"AF",null,null,null,null,"VF",null,null,"HF",null,"F",null,"Gesamt"]
[null,null,null,null,"F+","F-","F+","F-","F+","F-","F+","F-","F+","F+","F-","F-","F+","F-","F+","F-","+","-",null,"%"]
[null,null,{"$f":"A116","v":1},{"$f":"B116","v":""},{"$f":"VLOOKUP($D170,$D$2:$J$83,5,FALSE)","v":0},{"$f":"VLOOKUP($D170,$D$2:$J$83,6,FALSE)","v":0},{"$f":"IFERROR(VLOOKUP($D170,'2. Runde Gruppen'!$D$3:$I$20,5,FALSE),0)","v":0},{"$f":"IFERROR(VLOOKUP($D170,'2. Runde Gruppen'!$D$3:$I$20,6,FALSE),0)","v":0},{"$f":"IFERROR(VLOOKUP($D170,Finals!$B$4:$I$26,2,FALSE),0)","v":0},{"$f":"IFERROR(VLOOKUP($D170,Finals!$B$4:$I$26,8,FALSE),0)","v":0},null,null,null,{"$f":"IFERROR(VLOOKUP($D170,Finals!$J$6:$K$24,2,FALSE),0)","v":0},{"$f":"IFERROR(VLOOKUP($D170,Finals!$O$6:$P$24,2,FALSE),0)","v":0},null,{"$f":"IFERROR(VLOOKUP($D170,Finals!$Q$10:$W$20,2,FALSE),0)","v":0},{"$f":"IFERROR(VLOOKUP($D170,Finals!$Q$10:$W$20,7,FALSE),0)","v":0},{"$f":"IFERROR(VLOOKUP($D170,Finals!$X$14:$AD$15,2,FALSE),0)","v":0},{"$f":"IFERROR(VLOOKUP($D170,Finals!$X$14:$AD$15,7,FALSE),0)","v":0},{"$f":"E170+G170+I170+N170+Q170+S170","v":0},{"$f":"F170+H170+J170+O170+R170+T170","v":0},{"$f":"U170+V170","v":0},{"$f":"IFERROR(U170/W170,\"\")","v":""}]
[null,null,2,"",0,0,{"$f":"IFERROR(VLOOKUP($D171,'2. Runde Gruppen'!$D$3:$I$20,5,FALSE),0)","v":0},{"$f":"IFERROR(VLOOKUP($D171,'2. Runde Gruppen'!$D$3:$I$20,6,FALSE),0)","v":0},{"$f":"IFERROR(VLOOKUP($D171,Finals!$B$4:$I$26,2,FALSE),0)","v":0},{"$f":"IFERROR(VLOOKUP($D171,Finals!$B$4:$I$26,8,FALSE),0)","v":0},null,null,null,{"$f":"IFERROR(VLOOKUP($D171,Finals!$J$6:$K$24,2,FALSE),0)","v":0},{"$f":"IFERROR(VLOOKUP($D171,Finals!$O$6:$P$24,2,FALSE),0)","v":0},null,{"$f":"IFERROR(VLOOKUP($D171,Finals!$Q$10:$W$20,2,FALSE),0)","v":0},{"$f":"IFERROR(VLOOKUP($D171,Finals!$Q$10:$W$20,7,FALSE),0)","v":0},{"$f":"IFERROR(VLOOKUP($D171,Finals!$X$14:$AD$15,2,FALSE),0)","v":0},{"$f":"IFERROR(VLOOKUP($D171,Finals!$X$14:$AD$15,7,FALSE),0)","v":0},{"$f":"E171+G171+I171+N171+Q171+S171","v":0},{"$f":"F171+H171+J171+O171+R171+T171","v":0},{"$f":"U171+V171","v":0},{"$f":"IFERROR(U171/W171,\"\")","v":""}]
[null,null,3,"",0,0,{"$f":"IFERROR(VLOOKUP($D172,'2. Runde Gruppen'!$D$3:$I$20,5,FALSE),0)","v":0},{"$f":"IFERROR(VLOOKUP($D172,'2. Runde Gruppen'!$D$3:$I$20,6,FALSE),0)","v":0},{"$f":"IFERROR(VLOOKUP($D172,Finals!$B$4:$I$26,2,FALSE),0)","v":0},{"$f":"IFERROR(VLOOKUP($D172,Finals!$B$4:$I$26,8,FALSE),0)","v":0},null,null,null,{"$f":"IFERROR(VLOOKUP($D172,Finals!$J$6:$K$24,2,FALSE),0)","v":0},{"$f":"IFERROR(VLOOKUP($D172,Finals!$O$6:$P$24,2,FALSE),0)","v":0},null,{"$f":"IFERROR(VLOOKUP($D172,Finals!$Q$10:$W$20,2,FALSE),0)","v":0},{"$f":"IFERROR(VLOOKUP($D172,Finals!$Q$10:$W$20,7,FALSE),0)","v":0},{"$f":"IFERROR(VLOOKUP($D172,Finals!$X$14:$AD$15,2,FALSE),0)","v":0},{"$f":"IFERROR(VLOOKUP($D172,Finals!$X$14:$AD$15,7,FALSE),0)","v":0},0,0,0,""]
[null,null,4,"",0,0,{"$f":"IFERROR(VLOOKUP($D173,'2. Runde Gruppen'!$D$3:$I$20,5,FALSE),0)","v":0},{"$f":"IFERROR(VLOOKUP($D173,'2. Runde Gruppen'!$D$3:$I$20,6,FALSE),0)","v":0},{"$f":"IFERROR(VLOOKUP($D173,Finals!$B$4:$I$26,2,FALSE),0)","v":0},{"$f":"IFERROR(VLOOKUP($D173,Finals!$B$4:$I$26,8,FALSE),0)","v":0},null,null,null,{"$f":"IFERROR(VLOOKUP($D173,Finals!$J$6:$K$24,2,FALSE),0)","v":0},{"$f":"IFERROR(VLOOKUP($D173,Finals!$O$6:$P$24,2,FALSE),0)","v":0},null,{"$f":"IFERROR(VLOOKUP($D173,Finals!$Q$10:$W$20,2,FALSE),0)","v":0},{"$f":"IFERROR(VLOOKUP($D173,Finals!$Q$10:$W$20,7,FALSE),0)","v":0},{"$f":"IFERROR(VLOOKUP($D173,Finals!$X$14:$AD$15,2,FALSE),0)","v":0},{"$f":"IFERROR(VLOOKUP($D173,Finals!$X$14:$AD$15,7,FALSE),0)","v":0},0,0,0,""]
[null,null,5,"",0,0,{"$f":"IFERROR(VLOOKUP($D174,'2. Runde Gruppen'!$D$3:$I$20,5,FALSE),0)","v":0},{"$f":"IFERROR(VLOOKUP($D174,'2. Runde Gruppen'!$D$3:$I$20,6,FALSE),0)","v":0},{"$f":"IFERROR(VLOOKUP($D174,Finals!$B$4:$I$26,2,FALSE),0)","v":0},{"$f":"IFERROR(VLOOKUP($D174,Finals!$B$4:$I$26,8,FALSE),0)","v":0},null,null,null,{"$f":"IFERROR(VLOOKUP($D174,Finals!$J$6:$K$24,2,FALSE),0)","v":0},{"$f":"IFERROR(VLOOKUP($D174,Finals!$O$6:$P$24,2,FALSE),0)","v":0},null,{"$f":"IFERROR(VLOOKUP($D174,Finals!$Q$10:$W$20,2,FALSE),0)","v":0},{"$f":"IFERROR(VLOOKUP($D174,Finals!$Q$10:$W$20,7,FALSE),0)","v":0},{"$f":"IFERROR(VLOOKUP($D174,Finals!$X$14:$AD$15,2,FALSE),0)","v":0},{"$f":"IFERROR(VLOOKUP($D174,Finals!$X$14:$AD$15,7,FALSE),0)","v":0},0,0,0,""]
[null,null,6,"",0,0,{"$f":"IFERROR(VLOOKUP($D175,'2. Runde Gruppen'!$D$3:$I$20,5,FALSE),0)","v":0},{"$f":"IFERROR(VLOOKUP($D175,'2. Runde Gruppen'!$D$3:$I$20,6,FALSE),0)","v":0},{"$f":"IFERROR(VLOOKUP($D175,Finals!$B$4:$I$26,2,FALSE),0)","v":0},{"$f":"IFERROR(VLOOKUP($D175,Finals!$B$4:$I$26,8,FALSE),0)","v":0},null,null,null,{"$f":"IFERROR(VLOOKUP($D175,Finals!$J$6:$K$24,2,FALSE),0)","v":0},{"$f":"IFERROR(VLOOKUP($D175,Finals!$O$6:$P$24,2,FALSE),0)","v":0},null,{"$f":"IFERROR(VLOOKUP($D175,Finals!$Q$10:$W$20,2,FALSE),0)","v":0},{"$f":"IFERROR(VLOOKUP($D175,Finals!$Q$10:$W$20,7,FALSE),0)","v":0},{"$f":"IFERROR(VLOOKUP($D175,Finals!$X$14:$AD$15,2,FALSE),0)","v":0},{"$f":"IFERROR(VLOOKUP($D175,Finals!$X$14:$AD$15,7,FALSE),0)","v":0},0,{"$f":"F175+H175+J175+O175+R175+T175","v":0},0,{"$f":"IFERROR(U175/W175,\"\")","v":""}]
[null,null,7,"",{"$f":"VLOOKUP($D176,$D$2:$J$83,5,FALSE)","v":0},{"$f":"VLOOKUP($D176,$D$2:$J$83,6,FALSE)","v":0},{"$f":"IFERROR(VLOOKUP($D176,'2. Runde Gruppen'!$D$3:$I$20,5,FALSE),0)","v":0},{"$f":"IFERROR(VLOOKUP($D176,'2. Runde Gruppen'!$D$3:$I$20,6,FALSE),0)","v":0},{"$f":"IFERROR(VLOOKUP($D176,Finals!$B$4:$I$26,2,FALSE),0)","v":0},{"$f":"IFERROR(VLOOKUP($D176,Finals!$B$4:$I$26,8,FALSE),0)","v":0},null,null,null,{"$f":"IFERROR(VLOOKUP($D176,Finals!$J$6:$K$24,2,FALSE),0)","v":0},{"$f":"IFERROR(VLOOKUP($D176,Finals!$O$6:$P$24,2,FALSE),0)","v":0},null,{"$f":"IFERROR(VLOOKUP($D176,Finals!$Q$10:$W$20,2,FALSE),0)","v":0},{"$f":"IFERROR(VLOOKUP($D176,Finals!$Q$10:$W$20,7,FALSE),0)","v":0},{"$f":"IFERROR(VLOOKUP($D176,Finals!$X$14:$AD$15,2,FALSE),0)","v":0},{"$f":"IFERROR(VLOOKUP($D176,Finals!$X$14:$AD$15,7,FALSE),0)","v":0},0,0,0,""]
[null,null,8,"",0,0,{"$f":"IFERROR(VLOOKUP($D177,'2. Runde Gruppen'!$D$3:$I$20,5,FALSE),0)","v":0},{"$f":"IFERROR(VLOOKUP($D177,'2. Runde Gruppen'!$D$3:$I$20,6,FALSE),0)","v":0},{"$f":"IFERROR(VLOOKUP($D177,Finals!$B$4:$I$26,2,FALSE),0)","v":0},{"$f":"IFERROR(VLOOKUP($D177,Finals!$B$4:$I$26,8,FALSE),0)","v":0},null,null,null,{"$f":"IFERROR(VLOOKUP($D177,Finals!$J$6:$K$24,2,FALSE),0)","v":0},{"$f":"IFERROR(VLOOKUP($D177,Finals!$O$6:$P$24,2,FALSE),0)","v":0},null,{"$f":"IFERROR(VLOOKUP($D177,Finals!$Q$10:$W$20,2,FALSE),0)","v":0},{"$f":"IFERROR(VLOOKUP($D177,Finals!$Q$10:$W$20,7,FALSE),0)","v":0},{"$f":"IFERROR(VLOOKUP($D177,Finals!$X$14:$AD$15,2,FALSE),0)","v":0},{"$f":"IFERROR(VLOOKUP($D177,Finals!$X$14:$AD$15,7,FALSE),0)","v":0},0,0,0,""]
[null,null,9,"",0,0,{"$f":"IFERROR(VLOOKUP($D178,'2. Runde Gruppen'!$D$3:$I$20,5,FALSE),0)","v":0},{"$f":"IFERROR(VLOOKUP($D178,'2. Runde Gruppen'!$D$3:$I$20,6,FALSE),0)","v":0},{"$f":"IFERROR(VLOOKUP($D178,Finals!$B$4:$I$26,2,FALSE),0)","v":0},{"$f":"IFERROR(VLOOKUP($D178,Finals!$B$4:$I$26,8,FALSE),0)","v":0},null,null,null,{"$f":"IFERROR(VLOOKUP($D178,Finals!$J$6:$K$24,2,FALSE),0)","v":0},{"$f":"IFERROR(VLOOKUP($D178,Finals!$O$6:$P$24,2,FALSE),0)","v":0},null,{"$f":"IFERROR(VLOOKUP($D178,Finals!$Q$10:$W$20,2,FALSE),0)","v":0},{"$f":"IFERROR(VLOOKUP($D178,Finals!$Q$10:$W$20,7,FALSE),0)","v":0},{"$f":"IFERROR(VLOOKUP($D178,Finals!$X$14:$AD$15,2,FALSE),0)","v":0},{"$f":"IFERROR(VLOOKUP($D178,Finals!$X$14:$AD$15,7,FALSE),0)","v":0},0,0,{"$f":"U178+V178","v":0},""]
[null,null,10,"",0,0,{"$f":"IFERROR(VLOOKUP($D179,'2. Runde Gruppen'!$D$3:$I$20,5,FALSE),0)","v":0},{"$f":"IFERROR(VLOOKUP($D179,'2. Runde Gruppen'!$D$3:$I$20,6,FALSE),0)","v":0},{"$f":"IFERROR(VLOOKUP($D179,Finals!$B$4:$I$26,2,FALSE),0)","v":0},{"$f":"IFERROR(VLOOKUP($D179,Finals!$B$4:$I$26,8,FALSE),0)","v":0},null,null,null,{"$f":"IFERROR(VLOOKUP($D179,Finals!$J$6:$K$24,2,FALSE),0)","v":0},{"$f":"IFERROR(VLOOKUP($D179,Finals!$O$6:$P$24,2,FALSE),0)","v":0},null,{"$f":"IFERROR(VLOOKUP($D179,Finals!$Q$10:$W$20,2,FALSE),0)","v":0},{"$f":"IFERROR(VLOOKUP($D179,Finals!$Q$10:$W$20,7,FALSE),0)","v":0},{"$f":"IFERROR(VLOOKUP($D179,Finals!$X$14:$AD$15,2,FALSE),0)","v":0},{"$f":"IFERROR(VLOOKUP($D179,Finals!$X$14:$AD$15,7,FALSE),0)","v":0},0,0,0,""]
[null,null,11,"",0,0,{"$f":"IFERROR(VLOOKUP($D180,'2. Runde Gruppen'!$D$3:$I$20,5,FALSE),0)","v":0},{"$f":"IFERROR(VLOOKUP($D180,'2. Runde Gruppen'!$D$3:$I$20,6,FALSE),0)","v":0},{"$f":"IFERROR(VLOOKUP($D180,Finals!$B$4:$I$26,2,FALSE),0)","v":0},{"$f":"IFERROR(VLOOKUP($D180,Finals!$B$4:$I$26,8,FALSE),0)","v":0},null,null,null,{"$f":"IFERROR(VLOOKUP($D180,Finals!$J$6:$K$24,2,FALSE),0)","v":0},{"$f":"IFERROR(VLOOKUP($D180,Finals!$O$6:$P$24,2,FALSE),0)","v":0},null,{"$f":"IFERROR(VLOOKUP($D180,Finals!$Q$10:$W$20,2,FALSE),0)","v":0},{"$f":"IFERROR(VLOOKUP($D180,Finals!$Q$10:$W$20,7,FALSE),0)","v":0},{"$f":"IFERROR(VLOOKUP($D180,Finals!$X$14:$AD$15,2,FALSE),0)","v":0},{"$f":"IFERROR(VLOOKUP($D180,Finals!$X$14:$AD$15,7,FALSE),0)","v":0},0,0,0,""]
[null,null,12,"",0,0,{"$f":"IFERROR(VLOOKUP($D181,'2. Runde Gruppen'!$D$3:$I$20,5,FALSE),0)","v":0},{"$f":"IFERROR(VLOOKUP($D181,'2. Runde Gruppen'!$D$3:$I$20,6,FALSE),0)","v":0},{"$f":"IFERROR(VLOOKUP($D181,Finals!$B$4:$I$26,2,FALSE),0)","v":0},{"$f":"IFERROR(VLOOKUP($D181,Finals!$B$4:$I$26,8,FALSE),0)","v":0},null,null,null,{"$f":"IFERROR(VLOOKUP($D181,Finals!$J$6:$K$24,2,FALSE),0)","v":0},{"$f":"IFERROR(VLOOKUP($D181,Finals!$O$6:$P$24,2,FALSE),0)","v":0},null,{"$f":"IFERROR(VLOOKUP($D181,Finals!$Q$10:$W$20,2,FALSE),0)","v":0},{"$f":"IFERROR(VLOOKUP($D181,Finals!$Q$10:$W$20,7,FALSE),0)","v":0},{"$f":"IFERROR(VLOOKUP($D181,Finals!$X$14:$AD$15,2,FALSE),0)","v":0},{"$f":"IFERROR(VLOOKUP($D181,Finals!$X$14:$AD$15,7,FALSE),0)","v":0},0,0,0,""]
[null,null,13,"",0,0,{"$f":"IFERROR(VLOOKUP($D182,'2. Runde Gruppen'!$D$3:$I$20,5,FALSE),0)","v":0},{"$f":"IFERROR(VLOOKUP($D182,'2. Runde Gruppen'!$D$3:$I$20,6,FALSE),0)","v":0},{"$f":"IFERROR(VLOOKUP($D182,Finals!$B$4:$I$26,2,FALSE),0)","v":0},{"$f":"IFERROR(VLOOKUP($D182,Finals!$B$4:$I$26,8,FALSE),0)","v":0},null,null,null,{"$f":"IFERROR(VLOOKUP($D182,Finals!$J$6:$K$24,2,FALSE),0)","v":0},{"$f":"IFERROR(VLOOKUP($D182,Finals!$O$6:$P$24,2,FALSE),0)","v":0},null,{"$f":"IFERROR(VLOOKUP($D182,Finals!$Q$10:$W$20,2,FALSE),0)","v":0},{"$f":"IFERROR(VLOOKUP($D182,Finals!$Q$10:$W$20,7,FALSE),0)","v":0},{"$f":"IFERROR(VLOOKUP($D182,Finals!$X$14:$AD$15,2,FALSE),0)","v":0},{"$f":"IFERROR(VLOOKUP($D182,Finals!$X$14:$AD$15,7,FALSE),0)","v":0},0,0,0,""]
[null,null,14,"",0,0,{"$f":"IFERROR(VLOOKUP($D183,'2. Runde Gruppen'!$D$3:$I$20,5,FALSE),0)","v":0},{"$f":"IFERROR(VLOOKUP($D183,'2. Runde Gruppen'!$D$3:$I$20,6,FALSE),0)","v":0},{"$f":"IFERROR(VLOOKUP($D183,Finals!$B$4:$I$26,2,FALSE),0)","v":0},{"$f":"IFERROR(VLOOKUP($D183,Finals!$B$4:$I$26,8,FALSE),0)","v":0},null,null,null,{"$f":"IFERROR(VLOOKUP($D183,Finals!$J$6:$K$24,2,FALSE),0)","v":0},{"$f":"IFERROR(VLOOKUP($D183,Finals!$O$6:$P$24,2,FALSE),0)","v":0},null,{"$f":"IFERROR(VLOOKUP($D183,Finals!$Q$10:$W$20,2,FALSE),0)","v":0},{"$f":"IFERROR(VLOOKUP($D183,Finals!$Q$10:$W$20,7,FALSE),0)","v":0},{"$f":"IFERROR(VLOOKUP($D183,Finals!$X$14:$AD$15,2,FALSE),0)","v":0},{"$f":"IFERROR(VLOOKUP($D183,Finals!$X$14:$AD$15,7,FALSE),0)","v":0},0,0,0,""]
[null,null,15,"",0,0,{"$f":"IFERROR(VLOOKUP($D184,'2. Runde Gruppen'!$D$3:$I$20,5,FALSE),0)","v":0},{"$f":"IFERROR(VLOOKUP($D184,'2. Runde Gruppen'!$D$3:$I$20,6,FALSE),0)","v":0},{"$f":"IFERROR(VLOOKUP($D184,Finals!$B$4:$I$26,2,FALSE),0)","v":0},{"$f":"IFERROR(VLOOKUP($D184,Finals!$B$4:$I$26,8,FALSE),0)","v":0},null,null,null,{"$f":"IFERROR(VLOOKUP($D184,Finals!$J$6:$K$24,2,FALSE),0)","v":0},{"$f":"IFERROR(VLOOKUP($D184,Finals!$O$6:$P$24,2,FALSE),0)","v":0},null,{"$f":"IFERROR(VLOOKUP($D184,Finals!$Q$10:$W$20,2,FALSE),0)","v":0},{"$f":"IFERROR(VLOOKUP($D184,Finals!$Q$10:$W$20,7,FALSE),0)","v":0},{"$f":"IFERROR(VLOOKUP($D184,Finals!$X$14:$AD$15,2,FALSE),0)","v":0},{"$f":"IFERROR(VLOOKUP($D184,Finals!$X$14:$AD$15,7,FALSE),0)","v":0},0,0,0,""]
[null,null,16,"",0,0,{"$f":"IFERROR(VLOOKUP($D185,'2. Runde Gruppen'!$D$3:$I$20,5,FALSE),0)","v":0},{"$f":"IFERROR(VLOOKUP($D185,'2. Runde Gruppen'!$D$3:$I$20,6,FALSE),0)","v":0},{"$f":"IFERROR(VLOOKUP($D185,Finals!$B$4:$I$26,2,FALSE),0)","v":0},{"$f":"IFERROR(VLOOKUP($D185,Finals!$B$4:$I$26,8,FALSE),0)","v":0},null,null,null,{"$f":"IFERROR(VLOOKUP($D185,Finals!$J$6:$K$24,2,FALSE),0)","v":0},{"$f":"IFERROR(VLOOKUP($D185,Finals!$O$6:$P$24,2,FALSE),0)","v":0},null,{"$f":"IFERROR(VLOOKUP($D185,Finals!$Q$10:$W$20,2,FALSE),0)","v":0},{"$f":"IFERROR(VLOOKUP($D185,Finals!$Q$10:$W$20,7,FALSE),0)","v":0},{"$f":"IFERROR(VLOOKUP($D185,Finals!$X$14:$AD$15,2,FALSE),0)","v":0},{"$f":"IFERROR(VLOOKUP($D185,Finals!$X$14:$AD$15,7,FALSE),0)","v":0},0,0,0,""]
[null,null,17,"",0,0,{"$f":"IFERROR(VLOOKUP($D186,'2. Runde Gruppen'!$D$3:$I$20,5,FALSE),0)","v":0},{"$f":"IFERROR(VLOOKUP($D186,'2. Runde Gruppen'!$D$3:$I$20,6,FALSE),0)","v":0},{"$f":"IFERROR(VLOOKUP($D186,Finals!$B$4:$I$26,2,FALSE),0)","v":0},{"$f":"IFERROR(VLOOKUP($D186,Finals!$B$4:$I$26,8,FALSE),0)","v":0},null,null,null,{"$f":"IFERROR(VLOOKUP($D186,Finals!$J$6:$K$24,2,FALSE),0)","v":0},{"$f":"IFERROR(VLOOKUP($D186,Finals!$O$6:$P$24,2,FALSE),0)","v":0},null,{"$f":"IFERROR(VLOOKUP($D186,Finals!$Q$10:$W$20,2,FALSE),0)","v":0},{"$f":"IFERROR(VLOOKUP($D186,Finals!$Q$10:$W$20,7,FALSE),0)","v":0},{"$f":"IFERROR(VLOOKUP($D186,Finals!$X$14:$AD$15,2,FALSE),0)","v":0},{"$f":"IFERROR(VLOOKUP($D186,Finals!$X$14:$AD$15,7,FALSE),0)","v":0},0,0,0,""]
[null,null,18,"",0,0,{"$f":"IFERROR(VLOOKUP($D187,'2. Runde Gruppen'!$D$3:$I$20,5,FALSE),0)","v":0},{"$f":"IFERROR(VLOOKUP($D187,'2. Runde Gruppen'!$D$3:$I$20,6,FALSE),0)","v":0},{"$f":"IFERROR(VLOOKUP($D187,Finals!$B$4:$I$26,2,FALSE),0)","v":0},{"$f":"IFERROR(VLOOKUP($D187,Finals!$B$4:$I$26,8,FALSE),0)","v":0},null,null,null,{"$f":"IFERROR(VLOOKUP($D187,Finals!$J$6:$K$24,2,FALSE),0)","v":0},{"$f":"IFERROR(VLOOKUP($D187,Finals!$O$6:$P$24,2,FALSE),0)","v":0},null,{"$f":"IFERROR(VLOOKUP($D187,Finals!$Q$10:$W$20,2,FALSE),0)","v":0},{"$f":"IFERROR(VLOOKUP($D187,Finals!$Q$10:$W$20,7,FALSE),0)","v":0},{"$f":"IFERROR(VLOOKUP($D187,Finals!$X$14:$AD$15,2,FALSE),0)","v":0},{"$f":"IFERROR(VLOOKUP($D187,Finals!$X$14:$AD$15,7,FALSE),0)","v":0},0,{"$f":"F187+H187+J187+O187+R187+T187","v":0},0,""]
[null,null,19,"",0,0,{"$f":"IFERROR(VLOOKUP($D188,'2. Runde Gruppen'!$D$3:$I$20,5,FALSE),0)","v":0},{"$f":"IFERROR(VLOOKUP($D188,'2. Runde Gruppen'!$D$3:$I$20,6,FALSE),0)","v":0},{"$f":"IFERROR(VLOOKUP($D188,Finals!$B$4:$I$26,2,FALSE),0)","v":0},{"$f":"IFERROR(VLOOKUP($D188,Finals!$B$4:$I$26,8,FALSE),0)","v":0},null,null,null,{"$f":"IFERROR(VLOOKUP($D188,Finals!$J$6:$K$24,2,FALSE),0)","v":0},{"$f":"IFERROR(VLOOKUP($D188,Finals!$O$6:$P$24,2,FALSE),0)","v":0},null,{"$f":"IFERROR(VLOOKUP($D188,Finals!$Q$10:$W$20,2,FALSE),0)","v":0},{"$f":"IFERROR(VLOOKUP($D188,Finals!$Q$10:$W$20,7,FALSE),0)","v":0},{"$f":"IFERROR(VLOOKUP($D188,Finals!$X$14:$AD$15,2,FALSE),0)","v":0},{"$f":"IFERROR(VLOOKUP($D188,Finals!$X$14:$AD$15,7,FALSE),0)","v":0},0,0,0,""]
[null,null,20,"",0,0,{"$f":"IFERROR(VLOOKUP($D189,'2. Runde Gruppen'!$D$3:$I$20,5,FALSE),0)","v":0},{"$f":"IFERROR(VLOOKUP($D189,'2. Runde Gruppen'!$D$3:$I$20,6,FALSE),0)","v":0},{"$f":"IFERROR(VLOOKUP($D189,Finals!$B$4:$I$26,2,FALSE),0)","v":0},{"$f":"IFERROR(VLOOKUP($D189,Finals!$B$4:$I$26,8,FALSE),0)","v":0},null,null,null,{"$f":"IFERROR(VLOOKUP($D189,Finals!$J$6:$K$24,2,FALSE),0)","v":0},{"$f":"IFERROR(VLOOKUP($D189,Finals!$O$6:$P$24,2,FALSE),0)","v":0},null,{"$f":"IFERROR(VLOOKUP($D189,Finals!$Q$10:$W$20,2,FALSE),0)","v":0},{"$f":"IFERROR(VLOOKUP($D189,Finals!$Q$10:$W$20,7,FALSE),0)","v":0},{"$f":"IFERROR(VLOOKUP($D189,Finals!$X$14:$AD$15,2,FALSE),0)","v":0},{"$f":"IFERROR(VLOOKUP($D189,Finals!$X$14:$AD$15,7,FALSE),0)","v":0},0,0,0,""]
[null,null,21,"",0,0,{"$f":"IFERROR(VLOOKUP($D190,'2. Runde Gruppen'!$D$3:$I$20,5,FALSE),0)","v":0},{"$f":"IFERROR(VLOOKUP($D190,'2. Runde Gruppen'!$D$3:$I$20,6,FALSE),0)","v":0},{"$f":"IFERROR(VLOOKUP($D190,Finals!$B$4:$I$26,2,FALSE),0)","v":0},{"$f":"IFERROR(VLOOKUP($D190,Finals!$B$4:$I$26,8,FALSE),0)","v":0},null,null,null,{"$f":"IFERROR(VLOOKUP($D190,Finals!$J$6:$K$24,2,FALSE),0)","v":0},{"$f":"IFERROR(VLOOKUP($D190,Finals!$O$6:$P$24,2,FALSE),0)","v":0},null,{"$f":"IFERROR(VLOOKUP($D190,Finals!$Q$10:$W$20,2,FALSE),0)","v":0},{"$f":"IFERROR(VLOOKUP($D190,Finals!$Q$10:$W$20,7,FALSE),0)","v":0},{"$f":"IFERROR(VLOOKUP($D190,Finals!$X$14:$AD$15,2,FALSE),0)","v":0},{"$f":"IFERROR(VLOOKUP($D190,Finals!$X$14:$AD$15,7,FALSE),0)","v":0},0,0,0,""]
[null,null,22,"",0,0,{"$f":"IFERROR(VLOOKUP($D191,'2. Runde Gruppen'!$D$3:$I$20,5,FALSE),0)","v":0},{"$f":"IFERROR(VLOOKUP($D191,'2. Runde Gruppen'!$D$3:$I$20,6,FALSE),0)","v":0},{"$f":"IFERROR(VLOOKUP($D191,Finals!$B$4:$I$26,2,FALSE),0)","v":0},{"$f":"IFERROR(VLOOKUP($D191,Finals!$B$4:$I$26,8,FALSE),0)","v":0},null,null,null,{"$f":"IFERROR(VLOOKUP($D191,Finals!$J$6:$K$24,2,FALSE),0)","v":0},{"$f":"IFERROR(VLOOKUP($D191,Finals!$O$6:$P$24,2,FALSE),0)","v":0},null,{"$f":"IFERROR(VLOOKUP($D191,Finals!$Q$10:$W$20,2,FALSE),0)","v":0},{"$f":"IFERROR(VLOOKUP($D191,Finals!$Q$10:$W$20,7,FALSE),0)","v":0},{"$f":"IFERROR(VLOOKUP($D191,Finals!$X$14:$AD$15,2,FALSE),0)","v":0},{"$f":"IFERROR(VLOOKUP($D191,Finals!$X$14:$AD$15,7,FALSE),0)","v":0},0,0,0,""]
[null,null,23,"",0,0,{"$f":"IFERROR(VLOOKUP($D192,'2. Runde Gruppen'!$D$3:$I$20,5,FALSE),0)","v":0},{"$f":"IFERROR(VLOOKUP($D192,'2. Runde Gruppen'!$D$3:$I$20,6,FALSE),0)","v":0},{"$f":"IFERROR(VLOOKUP($D192,Finals!$B$4:$I$26,2,FALSE),0)","v":0},{"$f":"IFERROR(VLOOKUP($D192,Finals!$B$4:$I$26,8,FALSE),0)","v":0},null,null,null,{"$f":"IFERROR(VLOOKUP($D192,Finals!$J$6:$K$24,2,FALSE),0)","v":0},{"$f":"IFERROR(VLOOKUP($D192,Finals!$O$6:$P$24,2,FALSE),0)","v":0},null,{"$f":"IFERROR(VLOOKUP($D192,Finals!$Q$10:$W$20,2,FALSE),0)","v":0},{"$f":"IFERROR(VLOOKUP($D192,Finals!$Q$10:$W$20,7,FALSE),0)","v":0},{"$f":"IFERROR(VLOOKUP($D192,Finals!$X$14:$AD$15,2,FALSE),0)","v":0},{"$f":"IFERROR(VLOOKUP($D192,Finals!$X$14:$AD$15,7,FALSE),0)","v":0},0,0,0,""]
[null,null,24,"",0,0,{"$f":"IFERROR(VLOOKUP($D193,'2. Runde Gruppen'!$D$3:$I$20,5,FALSE),0)","v":0},{"$f":"IFERROR(VLOOKUP($D193,'2. Runde Gruppen'!$D$3:$I$20,6,FALSE),0)","v":0},{"$f":"IFERROR(VLOOKUP($D193,Finals!$B$4:$I$26,2,FALSE),0)","v":0},{"$f":"IFERROR(VLOOKUP($D193,Finals!$B$4:$I$26,8,FALSE),0)","v":0},null,null,null,{"$f":"IFERROR(VLOOKUP($D193,Finals!$J$6:$K$24,2,FALSE),0)","v":0},{"$f":"IFERROR(VLOOKUP($D193,Finals!$O$6:$P$24,2,FALSE),0)","v":0},null,{"$f":"IFERROR(VLOOKUP($D193,Finals!$Q$10:$W$20,2,FALSE),0)","v":0},{"$f":"IFERROR(VLOOKUP($D193,Finals!$Q$10:$W$20,7,FALSE),0)","v":0},{"$f":"IFERROR(VLOOKUP($D193,Finals!$X$14:$AD$15,2,FALSE),0)","v":0},{"$f":"IFERROR(VLOOKUP($D193,Finals!$X$14:$AD$15,7,FALSE),0)","v":0},0,0,0,""]
[null,null,25,"",0,0,{"$f":"IFERROR(VLOOKUP($D194,'2. Runde Gruppen'!$D$3:$I$20,5,FALSE),0)","v":0},{"$f":"IFERROR(VLOOKUP($D194,'2. Runde Gruppen'!$D$3:$I$20,6,FALSE),0)","v":0},{"$f":"IFERROR(VLOOKUP($D194,Finals!$B$4:$I$26,2,FALSE),0)","v":0},{"$f":"IFERROR(VLOOKUP($D194,Finals!$B$4:$I$26,8,FALSE),0)","v":0},null,null,null,{"$f":"IFERROR(VLOOKUP($D194,Finals!$J$6:$K$24,2,FALSE),0)","v":0},{"$f":"IFERROR(VLOOKUP($D194,Finals!$O$6:$P$24,2,FALSE),0)","v":0},null,{"$f":"IFERROR(VLOOKUP($D194,Finals!$Q$10:$W$20,2,FALSE),0)","v":0},{"$f":"IFERROR(VLOOKUP($D194,Finals!$Q$10:$W$20,7,FALSE),0)","v":0},{"$f":"IFERROR(VLOOKUP($D194,Finals!$X$14:$AD$15,2,FALSE),0)","v":0},{"$f":"IFERROR(VLOOKUP($D194,Finals!$X$14:$AD$15,7,FALSE),0)","v":0},0,0,0,""]
[null,null,26,"",0,0,{"$f":"IFERROR(VLOOKUP($D195,'2. Runde Gruppen'!$D$3:$I$20,5,FALSE),0)","v":0},{"$f":"IFERROR(VLOOKUP($D195,'2. Runde Gruppen'!$D$3:$I$20,6,FALSE),0)","v":0},{"$f":"IFERROR(VLOOKUP($D195,Finals!$B$4:$I$26,2,FALSE),0)","v":0},{"$f":"IFERROR(VLOOKUP($D195,Finals!$B$4:$I$26,8,FALSE),0)","v":0},null,null,null,{"$f":"IFERROR(VLOOKUP($D195,Finals!$J$6:$K$24,2,FALSE),0)","v":0},{"$f":"IFERROR(VLOOKUP($D195,Finals!$O$6:$P$24,2,FALSE),0)","v":0},null,{"$f":"IFERROR(VLOOKUP($D195,Finals!$Q$10:$W$20,2,FALSE),0)","v":0},{"$f":"IFERROR(VLOOKUP($D195,Finals!$Q$10:$W$20,7,FALSE),0)","v":0},{"$f":"IFERROR(VLOOKUP($D195,Finals!$X$14:$AD$15,2,FALSE),0)","v":0},{"$f":"IFERROR(VLOOKUP($D195,Finals!$X$14:$AD$15,7,FALSE),0)","v":0},0,0,0,""]
[null,null,27,"",0,0,{"$f":"IFERROR(VLOOKUP($D196,'2. Runde Gruppen'!$D$3:$I$20,5,FALSE),0)","v":0},{"$f":"IFERROR(VLOOKUP($D196,'2. Runde Gruppen'!$D$3:$I$20,6,FALSE),0)","v":0},{"$f":"IFERROR(VLOOKUP($D196,Finals!$B$4:$I$26,2,FALSE),0)","v":0},{"$f":"IFERROR(VLOOKUP($D196,Finals!$B$4:$I$26,8,FALSE),0)","v":0},null,null,null,{"$f":"IFERROR(VLOOKUP($D196,Finals!$J$6:$K$24,2,FALSE),0)","v":0},{"$f":"IFERROR(VLOOKUP($D196,Finals!$O$6:$P$24,2,FALSE),0)","v":0},null,{"$f":"IFERROR(VLOOKUP($D196,Finals!$Q$10:$W$20,2,FALSE),0)","v":0},{"$f":"IFERROR(VLOOKUP($D196,Finals!$Q$10:$W$20,7,FALSE),0)","v":0},{"$f":"IFERROR(VLOOKUP($D196,Finals!$X$14:$AD$15,2,FALSE),0)","v":0},{"$f":"IFERROR(VLOOKUP($D196,Finals!$X$14:$AD$15,7,FALSE),0)","v":0},0,0,0,""]
[null,null,28,"",0,0,{"$f":"IFERROR(VLOOKUP($D197,'2. Runde Gruppen'!$D$3:$I$20,5,FALSE),0)","v":0},{"$f":"IFERROR(VLOOKUP($D197,'2. Runde Gruppen'!$D$3:$I$20,6,FALSE),0)","v":0},{"$f":"IFERROR(VLOOKUP($D197,Finals!$B$4:$I$26,2,FALSE),0)","v":0},{"$f":"IFERROR(VLOOKUP($D197,Finals!$B$4:$I$26,8,FALSE),0)","v":0},null,null,null,{"$f":"IFERROR(VLOOKUP($D197,Finals!$J$6:$K$24,2,FALSE),0)","v":0},{"$f":"IFERROR(VLOOKUP($D197,Finals!$O$6:$P$24,2,FALSE),0)","v":0},null,{"$f":"IFERROR(VLOOKUP($D197,Finals!$Q$10:$W$20,2,FALSE),0)","v":0},{"$f":"IFERROR(VLOOKUP($D197,Finals!$Q$10:$W$20,7,FALSE),0)","v":0},{"$f":"IFERROR(VLOOKUP($D197,Finals!$X$14:$AD$15,2,FALSE),0)","v":0},{"$f":"IFERROR(VLOOKUP($D197,Finals!$X$14:$AD$15,7,FALSE),0)","v":0},0,0,0,""]
[null,null,29,"",0,0,{"$f":"IFERROR(VLOOKUP($D198,'2. Runde Gruppen'!$D$3:$I$20,5,FALSE),0)","v":0},{"$f":"IFERROR(VLOOKUP($D198,'2. Runde Gruppen'!$D$3:$I$20,6,FALSE),0)","v":0},{"$f":"IFERROR(VLOOKUP($D198,Finals!$B$4:$I$26,2,FALSE),0)","v":0},{"$f":"IFERROR(VLOOKUP($D198,Finals!$B$4:$I$26,8,FALSE),0)","v":0},null,null,null,{"$f":"IFERROR(VLOOKUP($D198,Finals!$J$6:$K$24,2,FALSE),0)","v":0},{"$f":"IFERROR(VLOOKUP($D198,Finals!$O$6:$P$24,2,FALSE),0)","v":0},null,{"$f":"IFERROR(VLOOKUP($D198,Finals!$Q$10:$W$20,2,FALSE),0)","v":0},{"$f":"IFERROR(VLOOKUP($D198,Finals!$Q$10:$W$20,7,FALSE),0)","v":0},{"$f":"IFERROR(VLOOKUP($D198,Finals!$X$14:$AD$15,2,FALSE),0)","v":0},{"$f":"IFERROR(VLOOKUP($D198,Finals!$X$14:$AD$15,7,FALSE),0)","v":0},0,0,0,""]
[null,null,30,"",0,0,{"$f":"IFERROR(VLOOKUP($D199,'2. Runde Gruppen'!$D$3:$I$20,5,FALSE),0)","v":0},{"$f":"IFERROR(VLOOKUP($D199,'2. Runde Gruppen'!$D$3:$I$20,6,FALSE),0)","v":0},{"$f":"IFERROR(VLOOKUP($D199,Finals!$B$4:$I$26,2,FALSE),0)","v":0},{"$f":"IFERROR(VLOOKUP($D199,Finals!$B$4:$I$26,8,FALSE),0)","v":0},null,null,null,{"$f":"IFERROR(VLOOKUP($D199,Finals!$J$6:$K$24,2,FALSE),0)","v":0},{"$f":"IFERROR(VLOOKUP($D199,Finals!$O$6:$P$24,2,FALSE),0)","v":0},null,{"$f":"IFERROR(VLOOKUP($D199,Finals!$Q$10:$W$20,2,FALSE),0)","v":0},{"$f":"IFERROR(VLOOKUP($D199,Finals!$Q$10:$W$20,7,FALSE),0)","v":0},{"$f":"IFERROR(VLOOKUP($D199,Finals!$X$14:$AD$15,2,FALSE),0)","v":0},{"$f":"IFERROR(VLOOKUP($D199,Finals!$X$14:$AD$15,7,FALSE),0)","v":0},0,0,0,""]
[null,null,31,"",0,0,{"$f":"IFERROR(VLOOKUP($D200,'2. Runde Gruppen'!$D$3:$I$20,5,FALSE),0)","v":0},{"$f":"IFERROR(VLOOKUP($D200,'2. Runde Gruppen'!$D$3:$I$20,6,FALSE),0)","v":0},{"$f":"IFERROR(VLOOKUP($D200,Finals!$B$4:$I$26,2,FALSE),0)","v":0},{"$f":"IFERROR(VLOOKUP($D200,Finals!$B$4:$I$26,8,FALSE),0)","v":0},null,null,null,{"$f":"IFERROR(VLOOKUP($D200,Finals!$J$6:$K$24,2,FALSE),0)","v":0},{"$f":"IFERROR(VLOOKUP($D200,Finals!$O$6:$P$24,2,FALSE),0)","v":0},null,{"$f":"IFERROR(VLOOKUP($D200,Finals!$Q$10:$W$20,2,FALSE),0)","v":0},{"$f":"IFERROR(VLOOKUP($D200,Finals!$Q$10:$W$20,7,FALSE),0)","v":0},{"$f":"IFERROR(VLOOKUP($D200,Finals!$X$14:$AD$15,2,FALSE),0)","v":0},{"$f":"IFERROR(VLOOKUP($D200,Finals!$X$14:$AD$15,7,FALSE),0)","v":0},0,0,0,""]
[null,null,32,"",0,0,{"$f":"IFERROR(VLOOKUP($D201,'2. Runde Gruppen'!$D$3:$I$20,5,FALSE),0)","v":0},{"$f":"IFERROR(VLOOKUP($D201,'2. Runde Gruppen'!$D$3:$I$20,6,FALSE),0)","v":0},{"$f":"IFERROR(VLOOKUP($D201,Finals!$B$4:$I$26,2,FALSE),0)","v":0},{"$f":"IFERROR(VLOOKUP($D201,Finals!$B$4:$I$26,8,FALSE),0)","v":0},null,null,null,{"$f":"IFERROR(VLOOKUP($D201,Finals!$J$6:$K$24,2,FALSE),0)","v":0},{"$f":"IFERROR(VLOOKUP($D201,Finals!$O$6:$P$24,2,FALSE),0)","v":0},null,{"$f":"IFERROR(VLOOKUP($D201,Finals!$Q$10:$W$20,2,FALSE),0)","v":0},{"$f":"IFERROR(VLOOKUP($D201,Finals!$Q$10:$W$20,7,FALSE),0)","v":0},{"$f":"IFERROR(VLOOKUP($D201,Finals!$X$14:$AD$15,2,FALSE),0)","v":0},{"$f":"IFERROR(VLOOKUP($D201,Finals!$X$14:$AD$15,7,FALSE),0)","v":0},0,0,0,""]
[null,null,33,"",0,0,{"$f":"IFERROR(VLOOKUP($D202,'2. Runde Gruppen'!$D$3:$I$20,5,FALSE),0)","v":0},{"$f":"IFERROR(VLOOKUP($D202,'2. Runde Gruppen'!$D$3:$I$20,6,FALSE),0)","v":0},{"$f":"IFERROR(VLOOKUP($D202,Finals!$B$4:$I$26,2,FALSE),0)","v":0},{"$f":"IFERROR(VLOOKUP($D202,Finals!$B$4:$I$26,8,FALSE),0)","v":0},null,null,null,{"$f":"IFERROR(VLOOKUP($D202,Finals!$J$6:$K$24,2,FALSE),0)","v":0},{"$f":"IFERROR(VLOOKUP($D202,Finals!$O$6:$P$24,2,FALSE),0)","v":0},null,{"$f":"IFERROR(VLOOKUP($D202,Finals!$Q$10:$W$20,2,FALSE),0)","v":0},{"$f":"IFERROR(VLOOKUP($D202,Finals!$Q$10:$W$20,7,FALSE),0)","v":0},{"$f":"IFERROR(VLOOKUP($D202,Finals!$X$14:$AD$15,2,FALSE),0)","v":0},{"$f":"IFERROR(VLOOKUP($D202,Finals!$X$14:$AD$15,7,FALSE),0)","v":0},0,0,0,""]
[null,null,34,"",0,0,{"$f":"IFERROR(VLOOKUP($D203,'2. Runde Gruppen'!$D$3:$I$20,5,FALSE),0)","v":0},{"$f":"IFERROR(VLOOKUP($D203,'2. Runde Gruppen'!$D$3:$I$20,6,FALSE),0)","v":0},{"$f":"IFERROR(VLOOKUP($D203,Finals!$B$4:$I$26,2,FALSE),0)","v":0},{"$f":"IFERROR(VLOOKUP($D203,Finals!$B$4:$I$26,8,FALSE),0)","v":0},null,null,null,{"$f":"IFERROR(VLOOKUP($D203,Finals!$J$6:$K$24,2,FALSE),0)","v":0},{"$f":"IFERROR(VLOOKUP($D203,Finals!$O$6:$P$24,2,FALSE),0)","v":0},null,{"$f":"IFERROR(VLOOKUP($D203,Finals!$Q$10:$W$20,2,FALSE),0)","v":0},{"$f":"IFERROR(VLOOKUP($D203,Finals!$Q$10:$W$20,7,FALSE),0)","v":0},{"$f":"IFERROR(VLOOKUP($D203,Finals!$X$14:$AD$15,2,FALSE),0)","v":0},{"$f":"IFERROR(VLOOKUP($D203,Finals!$X$14:$AD$15,7,FALSE),0)","v":0},0,0,0,""]
[null,null,35,"",0,0,{"$f":"IFERROR(VLOOKUP($D204,'2. Runde Gruppen'!$D$3:$I$20,5,FALSE),0)","v":0},{"$f":"IFERROR(VLOOKUP($D204,'2. Runde Gruppen'!$D$3:$I$20,6,FALSE),0)","v":0},{"$f":"IFERROR(VLOOKUP($D204,Finals!$B$4:$I$26,2,FALSE),0)","v":0},{"$f":"IFERROR(VLOOKUP($D204,Finals!$B$4:$I$26,8,FALSE),0)","v":0},null,null,null,{"$f":"IFERROR(VLOOKUP($D204,Finals!$J$6:$K$24,2,FALSE),0)","v":0},{"$f":"IFERROR(VLOOKUP($D204,Finals!$O$6:$P$24,2,FALSE),0)","v":0},null,{"$f":"IFERROR(VLOOKUP($D204,Finals!$Q$10:$W$20,2,FALSE),0)","v":0},{"$f":"IFERROR(VLOOKUP($D204,Finals!$Q$10:$W$20,7,FALSE),0)","v":0},{"$f":"IFERROR(VLOOKUP($D204,Finals!$X$14:$AD$15,2,FALSE),0)","v":0},{"$f":"IFERROR(VLOOKUP($D204,Finals!$X$14:$AD$15,7,FALSE),0)","v":0},0,0,0,""]
[null,null,36,"",0,0,{"$f":"IFERROR(VLOOKUP($D205,'2. Runde Gruppen'!$D$3:$I$20,5,FALSE),0)","v":0},{"$f":"IFERROR(VLOOKUP($D205,'2. Runde Gruppen'!$D$3:$I$20,6,FALSE),0)","v":0},{"$f":"IFERROR(VLOOKUP($D205,Finals!$B$4:$I$26,2,FALSE),0)","v":0},{"$f":"IFERROR(VLOOKUP($D205,Finals!$B$4:$I$26,8,FALSE),0)","v":0},null,null,null,{"$f":"IFERROR(VLOOKUP($D205,Finals!$J$6:$K$24,2,FALSE),0)","v":0},{"$f":"IFERROR(VLOOKUP($D205,Finals!$O$6:$P$24,2,FALSE),0)","v":0},null,{"$f":"IFERROR(VLOOKUP($D205,Finals!$Q$10:$W$20,2,FALSE),0)","v":0},{"$f":"IFERROR(VLOOKUP($D205,Finals!$Q$10:$W$20,7,FALSE),0)","v":0},{"$f":"IFERROR(VLOOKUP($D205,Finals!$X$14:$AD$15,2,FALSE),0)","v":0},{"$f":"IFERROR(VLOOKUP($D205,Finals!$X$14:$AD$15,7,FALSE),0)","v":0},0,0,0,""]
[null,null,37,"",0,0,{"$f":"IFERROR(VLOOKUP($D206,'2. Runde Gruppen'!$D$3:$I$20,5,FALSE),0)","v":0},{"$f":"IFERROR(VLOOKUP($D206,'2. Runde Gruppen'!$D$3:$I$20,6,FALSE),0)","v":0},{"$f":"IFERROR(VLOOKUP($D206,Finals!$B$4:$I$26,2,FALSE),0)","v":0},{"$f":"IFERROR(VLOOKUP($D206,Finals!$B$4:$I$26,8,FALSE),0)","v":0},null,null,null,{"$f":"IFERROR(VLOOKUP($D206,Finals!$J$6:$K$24,2,FALSE),0)","v":0},{"$f":"IFERROR(VLOOKUP($D206,Finals!$O$6:$P$24,2,FALSE),0)","v":0},null,{"$f":"IFERROR(VLOOKUP($D206,Finals!$Q$10:$W$20,2,FALSE),0)","v":0},{"$f":"IFERROR(VLOOKUP($D206,Finals!$Q$10:$W$20,7,FALSE),0)","v":0},{"$f":"IFERROR(VLOOKUP($D206,Finals!$X$14:$AD$15,2,FALSE),0)","v":0},{"$f":"IFERROR(VLOOKUP($D206,Finals!$X$14:$AD$15,7,FALSE),0)","v":0},0,0,0,""]
[null,null,38,"",0,0,{"$f":"IFERROR(VLOOKUP($D207,'2. Runde Gruppen'!$D$3:$I$20,5,FALSE),0)","v":0},{"$f":"IFERROR(VLOOKUP($D207,'2. Runde Gruppen'!$D$3:$I$20,6,FALSE),0)","v":0},{"$f":"IFERROR(VLOOKUP($D207,Finals!$B$4:$I$26,2,FALSE),0)","v":0},{"$f":"IFERROR(VLOOKUP($D207,Finals!$B$4:$I$26,8,FALSE),0)","v":0},null,null,null,{"$f":"IFERROR(VLOOKUP($D207,Finals!$J$6:$K$24,2,FALSE),0)","v":0},{"$f":"IFERROR(VLOOKUP($D207,Finals!$O$6:$P$24,2,FALSE),0)","v":0},null,{"$f":"IFERROR(VLOOKUP($D207,Finals!$Q$10:$W$20,2,FALSE),0)","v":0},{"$f":"IFERROR(VLOOKUP($D207,Finals!$Q$10:$W$20,7,FALSE),0)","v":0},{"$f":"IFERROR(VLOOKUP($D207,Finals!$X$14:$AD$15,2,FALSE),0)","v":0},{"$f":"IFERROR(VLOOKUP($D207,Finals!$X$14:$AD$15,7,FALSE),0)","v":0},0,0,0,""]
[null,null,39,"",0,0,{"$f":"IFERROR(VLOOKUP($D208,'2. Runde Gruppen'!$D$3:$I$20,5,FALSE),0)","v":0},{"$f":"IFERROR(VLOOKUP($D208,'2. Runde Gruppen'!$D$3:$I$20,6,FALSE),0)","v":0},{"$f":"IFERROR(VLOOKUP($D208,Finals!$B$4:$I$26,2,FALSE),0)","v":0},{"$f":"IFERROR(VLOOKUP($D208,Finals!$B$4:$I$26,8,FALSE),0)","v":0},null,null,null,{"$f":"IFERROR(VLOOKUP($D208,Finals!$J$6:$K$24,2,FALSE),0)","v":0},{"$f":"IFERROR(VLOOKUP($D208,Finals!$O$6:$P$24,2,FALSE),0)","v":0},null,{"$f":"IFERROR(VLOOKUP($D208,Finals!$Q$10:$W$20,2,FALSE),0)","v":0},{"$f":"IFERROR(VLOOKUP($D208,Finals!$Q$10:$W$20,7,FALSE),0)","v":0},{"$f":"IFERROR(VLOOKUP($D208,Finals!$X$14:$AD$15,2,FALSE),0)","v":0},{"$f":"IFERROR(VLOOKUP($D208,Finals!$X$14:$AD$15,7,FALSE),0)","v":0},0,0,0,""]
[null,null,40,"",0,0,{"$f":"IFERROR(VLOOKUP($D209,'2. Runde Gruppen'!$D$3:$I$20,5,FALSE),0)","v":0},{"$f":"IFERROR(VLOOKUP($D209,'2. Runde Gruppen'!$D$3:$I$20,6,FALSE),0)","v":0},{"$f":"IFERROR(VLOOKUP($D209,Finals!$B$4:$I$26,2,FALSE),0)","v":0},{"$f":"IFERROR(VLOOKUP($D209,Finals!$B$4:$I$26,8,FALSE),0)","v":0},null,null,null,{"$f":"IFERROR(VLOOKUP($D209,Finals!$J$6:$K$24,2,FALSE),0)","v":0},{"$f":"IFERROR(VLOOKUP($D209,Finals!$O$6:$P$24,2,FALSE),0)","v":0},null,{"$f":"IFERROR(VLOOKUP($D209,Finals!$Q$10:$W$20,2,FALSE),0)","v":0},{"$f":"IFERROR(VLOOKUP($D209,Finals!$Q$10:$W$20,7,FALSE),0)","v":0},{"$f":"IFERROR(VLOOKUP($D209,Finals!$X$14:$AD$15,2,FALSE),0)","v":0},{"$f":"IFERROR(VLOOKUP($D209,Finals!$X$14:$AD$15,7,FALSE),0)","v":0},0,0,0,""]

{"sheet":"2. Runde Gruppen","index":5,"n_rows":27,"n_cols":43,"rows_kept":27,"cut":false,"hidden":true,"merged":[[0,3,0,31],[1,0,4,0],[1,19,1,20],[2,19,2,20],[3,19,3,20],[4,19,4,20],[1,31,1,34],[1,21,1,24],[6,0,9,0],[11,0,14,0],[14,19,14,20],[16,0,19,0],[12,19,12,20],[13,19,13,20],[16,19,16,20],[17,19,17,20],[18,19,18,20],[19,19,19,20],[6,19,6,20],[7,19,7,20],[8,19,8,20],[9,19,9,20],[11,19,11,20],[6,21,6,24],[11,21,11,24],[16,21,16,24],[6,31,6,34],[11,31,11,34],[16,31,16,34]]}
[{"$f":"Spieler!S12","v":0},null,null,"Zwischenrunde R2 - Drei Länder Ranking (GST-Serie)",null,null,null,null,null,null,null,null,null,null,null,null,null,null,null,null,null,null,null,null,null,null,null,null,null,null,null,null,null,null,null,null,null,null,null,null,null,null,"R2 abgeschlossen, Haken setzen"]
["A",null,"R2","Spieler","M","W","L","F+","F-",null,null,null,"Rang","Rang","P+",null,null,null,"Spieler","Spieler",null,"Breaks 30+",null,null,null,"F+","F-",null,null,null,null,"Breaks 30+",null,null,null,null,null,null,null,null,null,148,"Freigabe-Code Finals"]
[null,"A1",{"$f":"IF(AND(Spieler!$AG$1=\"X\",Spieler!$S$12<21),\"\",'2. Runde Gruppen'!B3)","v":""},{"$f":"IFERROR(IF(C3=\"\",\"\",IF(AND(Spieler!AG1=\"X\",Spieler!AG2<21),\"\",VLOOKUP(B3,Berechnung!$CP$90:$CQ$101,2,FALSE))),\"\")","v":""},{"$f":"AB3+AB4","v":0},{"$f":"AC3+AC4","v":0},{"$f":"AD3+AD4","v":0},{"$f":"Z3+Z4","v":0},{"$f":"AA3+AA4","v":0},null,null,null,{"$f":"IF(D3=\"\",(-90000),(F3*1000)+(H3*100)+E3-(G3*500)-(I3*50)+O3)","v":-90000},{"$f":"IF(E3=0,\"\",RANK(M3,M3:M5))","v":""},null,{"$f":"IF(D3=\"\",\"\",D3)","v":""},null,1,{"$f":"D3","v":""},{"$f":"D4","v":""},null,null,null,null,null,null,null,{"$f":"IF(Z3+AA3>0,1,0)","v":0},{"$f":"IF(Z3>AA3,1,0)","v":0},{"$f":"IF(AA3>Z3,1,0)","v":0},null,null,null,null,null,{"$f":"IFERROR(LARGE(V3:Y3,1),\"\")","v":""},{"$f":"S3","v":""},{"$f":"IFERROR(LARGE(AF3:AI3,1),\"\")","v":""},{"$f":"T3","v":""},{"$f":"IF(V3>0,1)+IF(W3>0,1)+IF(X3>0,1)+IF(Y3>0,1)","v":0},{"$f":"IF(AF3>0,1)+IF(AG3>0,1)+IF(AH3>0,1)+IF(AI3>0,1)","v":0},true]
[null,"A2",{"$f":"IF(AND(Spieler!$AG$1=\"X\",Spieler!$S$12<21),\"\",'2. Runde Gruppen'!B4)","v":""},{"$f":"IFERROR(IF(C3=\"\",\"\",IF(AND(Spieler!AG1=\"X\",Spieler!AG2<21),\"\",VLOOKUP(B4,Berechnung!$CP$90:$CQ$101,2,FALSE))),\"\")","v":""},{"$f":"AB3+AB5","v":0},{"$f":"AD3+AC5","v":0},{"$f":"AC3+AD5","v":0},{"$f":"AA3+Z5","v":0},{"$f":"Z3+AA5","v":0},null,null,null,{"$f":"IF(D4=\"\",(-90000),(F4*1000)+(H4*100)+E4-(G4*500)-(I4*50)+O4)","v":-90000},{"$f":"IF(E4=0,\"\",RANK(M4,M3:M5))","v":""},null,{"$f":"IF(D4=\"\",\"\",D4)","v":""},null,2,{"$f":"D3","v":""},{"$f":"D5","v":""},null,null,null,null,null,null,null,{"$f":"IF(Z4+AA4>0,1,0)","v":0},{"$f":"IF(Z4>AA4,1,0)","v":0},{"$f":"IF(AA4>Z4,1,0)","v":0},null,null,null,null,null,{"$f":"IFERROR(LARGE(V4:Y4,1),\"\")","v":""},{"$f":"S4","v":""},{"$f":"IFERROR(LARGE(AF4:AI4,1),\"\")","v":""},{"$f":"T4","v":""},{"$f":"IF(V4>0,1)+IF(W4>0,1)+IF(X4>0,1)+IF(Y4>0,1)","v":0},{"$f":"IF(AF4>0,1)+IF(AG4>0,1)+IF(AH4>0,1)+IF(AI4>0,1)","v":0}]
[null,"A3",{"$f":"IF(AND(Spieler!$AG$1=\"X\",Spieler!$S$12<21),\"\",'2. Runde Gruppen'!B5)","v":""},{"$f":"IFERROR(IF(C3=\"\",\"\",IF(AND(Spieler!AG1=\"X\",Spieler!AG2<21),\"\",VLOOKUP(B5,Berechnung!$CP$90:$CQ$101,2,FALSE))),\"\")","v":""},{"$f":"AB4+AB5","v":0},{"$f":"AD4+AD5","v":0},{"$f":"AC4+AC5","v":0},{"$f":"AA4+AA5","v":0},{"$f":"Z4+Z5","v":0},null,null,null,{"$f":"IF(D5=\"\",(-90000),(F5*1000)+(H5*100)+E5-(G5*500)-(I5*50)+O5)","v":-90000},{"$f":"IF(E5=0,\"\",RANK(M5,M3:M5))","v":""},null,{"$f":"IF(D5=\"\",\"\",D5)","v":""},null,3,{"$f":"D4","v":""},{"$f":"D5","v":""},null,null,null,null,null,null,null,{"$f":"IF(Z5+AA5>0,1,0)","v":0},{"$f":"IF(Z5>AA5,1,0)","v":0},{"$f":"IF(AA5>Z5,1,0)","v":0},null,null,null,null,null,{"$f":"IFERROR(LARGE(V5:Y5,1),\"\")","v":""},"",{"$f":"IFERROR(LARGE(AF5:AI5,1),\"\")","v":""},"",{"$f":"IF(V5>0,1)+IF(W5>0,1)+IF(X5>0,1)+IF(Y5>0,1)","v":0},{"$f":"IF(AF5>0,1)+IF(AG5>0,1)+IF(AH5>0,1)+IF(AI5>0,1)","v":0},null,"speichert unter C:\\Users\\Public\\Videos"]
[]
["B",null,"R2","Spieler","M","W","L","F+","F-",{"$f":"IF($A$1=11,Berechnung!N106,IF(A2=3,VLOOKUP(2,'2. Runde Gruppen'!O13:P15,2,FALSE),IF(A2=2,Berechnung!N98,IF(A2=1,Berechnung!N98,IF(C7>C8,B7,B8)))))","v":0},null,null,"Rang","Rang","P+",null,null,null,"Spieler","Spieler",null,"Breaks 30+",null,null,null,"F+","F-",null,null,null,null,"Breaks 30+"]
[null,"B1",{"$f":"IF(AND(Spieler!$AG$1=\"X\",Spieler!$S$12<21),\"\",'2. Runde Gruppen'!B8)","v":""},{"$f":"IFERROR(IF(C3=\"\",\"\",IF(AND(Spieler!AG1=\"X\",Spieler!AG2<21),\"\",VLOOKUP(B8,Berechnung!$CP$90:$CQ$101,2,FALSE))),\"\")","v":""},{"$f":"AB8+AB9","v":0},{"$f":"AC8+AC9","v":0},{"$f":"AD8+AD9","v":0},{"$f":"Z8+Z9","v":0},{"$f":"AA8+AA9","v":0},null,null,null,{"$f":"IF(D8=\"\",(-90000),(F8*1000)+(H8*100)+E8-(G8*500)-(I8*50)+O8)","v":-90000},{"$f":"IF(E8=0,\"\",RANK(M8,M8:M10))","v":""},null,{"$f":"IF(D8=\"\",\"\",D8)","v":""},null,1,{"$f":"D8","v":""},{"$f":"D9","v":""},null,null,null,null,null,null,null,{"$f":"IF(Z8+AA8>0,1,0)","v":0},{"$f":"IF(Z8>AA8,1,0)","v":0},{"$f":"IF(AA8>Z8,1,0)","v":0},null,null,null,null,null,{"$f":"IFERROR(LARGE(V8:Y8,1),\"\")","v":""},"",{"$f":"IFERROR(LARGE(AF8:AI8,1),\"\")","v":""},"",{"$f":"IF(V8>0,1)+IF(W8>0,1)+IF(X8>0,1)+IF(Y8>0,1)","v":0},{"$f":"IF(AF8>0,1)+IF(AG8>0,1)+IF(AH8>0,1)+IF(AI8>0,1)","v":0}]
[null,"B2",{"$f":"IF(AND(Spieler!$AG$1=\"X\",Spieler!$S$12<21),\"\",'2. Runde Gruppen'!B9)","v":""},{"$f":"IFERROR(IF(C3=\"\",\"\",IF(AND(Spieler!AG1=\"X\",Spieler!AG2<21),\"\",VLOOKUP(B9,Berechnung!$CP$90:$CQ$101,2,FALSE))),\"\")","v":""},{"$f":"AB8+AB10","v":0},{"$f":"AD8+AC10","v":0},{"$f":"AC8+AD10","v":0},{"$f":"AA8+Z10","v":0},{"$f":"Z8+AA10","v":0},null,null,null,{"$f":"IF(D9=\"\",(-90000),(F9*1000)+(H9*100)+E9-(G9*500)-(I9*50)+O9)","v":-90000},{"$f":"IF(E9=0,\"\",RANK(M9,M8:M10))","v":""},null,{"$f":"IF(D9=\"\",\"\",D9)","v":""},null,2,{"$f":"D8","v":""},{"$f":"D10","v":""},null,null,null,null,null,null,null,{"$f":"IF(Z9+AA9>0,1,0)","v":0},{"$f":"IF(Z9>AA9,1,0)","v":0},{"$f":"IF(AA9>Z9,1,0)","v":0},null,null,null,null,null,{"$f":"IFERROR(LARGE(V9:Y9,1),\"\")","v":""},"",{"$f":"IFERROR(LARGE(AF9:AI9,1),\"\")","v":""},"",{"$f":"IF(V9>0,1)+IF(W9>0,1)+IF(X9>0,1)+IF(Y9>0,1)","v":0},{"$f":"IF(AF9>0,1)+IF(AG9>0,1)+IF(AH9>0,1)+IF(AI9>0,1)","v":0}]
[null,"B3",{"$f":"IF(AND(Spieler!$AG$1=\"X\",Spieler!$S$12<21),\"\",'2. Runde Gruppen'!B10)","v":""},{"$f":"IFERROR(IF(C3=\"\",\"\",IF(AND(Spieler!AG1=\"X\",Spieler!AG2<21),\"\",VLOOKUP(B10,Berechnung!$CP$90:$CQ$101,2,FALSE))),\"\")","v":""},{"$f":"AB9+AB10","v":0},{"$f":"AD9+AD10","v":0},{"$f":"AC9+AC10","v":0},{"$f":"AA9+AA10","v":0},{"$f":"Z9+Z10","v":0},null,null,null,{"$f":"IF(D10=\"\",(-90000),(F10*1000)+(H10*100)+E10-(G10*500)-(I10*50)+O10)","v":-90000},{"$f":"IF(E10=0,\"\",RANK(M10,M8:M10))","v":""},null,{"$f":"IF(D10=\"\",\"\",D10)","v":""},null,3,{"$f":"D9","v":""},{"$f":"D10","v":""},null,null,null,null,null,null,null,{"$f":"IF(Z10+AA10>0,1,0)","v":0},{"$f":"IF(Z10>AA10,1,0)","v":0},{"$f":"IF(AA10>Z10,1,0)","v":0},null,null,null,null,null,{"$f":"IFERROR(LARGE(V10:Y10,1),\"\")","v":""},"",{"$f":"IFERROR(LARGE(AF10:AI10,1),\"\")","v":""},"",{"$f":"IF(V10>0,1)+IF(W10>0,1)+IF(X10>0,1)+IF(Y10>0,1)","v":0},{"$f":"IF(AF10>0,1)+IF(AG10>0,1)+IF(AH10>0,1)+IF(AI10>0,1)","v":0}]
[]
["C",null,"R2","Spieler","M","W","L","F+","F-",null,null,null,"Rang","Rang","P+",null,null,null,"Spieler","Spieler",null,"Breaks 30+",null,null,null,"F+","F-",null,null,null,null,"Breaks 30+"]
[null,"C1",{"$f":"IF(AND(Spieler!$AG$1=\"X\",Spieler!$S$12<21),\"\",'2. Runde Gruppen'!B13)","v":""},{"$f":"IFERROR(IF(C3=\"\",\"\",IF(AND(Spieler!AG1=\"X\",Spieler!AG2<21),\"\",VLOOKUP(B13,Berechnung!$CP$90:$CQ$101,2,FALSE))),\"\")","v":""},{"$f":"AB13+AB14","v":0},{"$f":"AC13+AC14","v":0},{"$f":"AD13+AD14","v":0},{"$f":"Z13+Z14","v":0},{"$f":"AA13+AA14","v":0},null,null,null,{"$f":"IF(D13=\"\",(-90000),(F13*1000)+(H13*100)+E13-(G13*500)-(I13*50)+O13)","v":-90000},{"$f":"IF(E13=0,\"\",RANK(M13,M13:M15))","v":""},null,{"$f":"IF(D13=\"\",\"\",D13)","v":""},null,1,{"$f":"D13","v":""},{"$f":"D14","v":""},null,null,null,null,null,null,null,{"$f":"IF(Z13+AA13>0,1,0)","v":0},{"$f":"IF(Z13>AA13,1,0)","v":0},{"$f":"IF(AA13>Z13,1,0)","v":0},null,null,null,null,null,{"$f":"IFERROR(LARGE(V13:Y13,1),\"\")","v":""},"",{"$f":"IFERROR(LARGE(AF13:AI13,1),\"\")","v":""},"",{"$f":"IF(V13>0,1)+IF(W13>0,1)+IF(X13>0,1)+IF(Y13>0,1)","v":0},{"$f":"IF(AF13>0,1)+IF(AG13>0,1)+IF(AH13>0,1)+IF(AI13>0,1)","v":0}]
[null,"C2",{"$f":"IF(AND(Spieler!$AG$1=\"X\",Spieler!$S$12<21),\"\",'2. Runde Gruppen'!B14)","v":""},{"$f":"IFERROR(IF(C3=\"\",\"\",IF(AND(Spieler!AG1=\"X\",Spieler!AG2<21),\"\",VLOOKUP(B14,Berechnung!$CP$90:$CQ$101,2,FALSE))),\"\")","v":""},{"$f":"AB13+AB15","v":0},{"$f":"AD13+AC15","v":0},{"$f":"AC13+AD15","v":0},{"$f":"AA13+Z15","v":0},{"$f":"Z13+AA15","v":0},null,null,null,{"$f":"IF(D14=\"\",(-90000),(F14*1000)+(H14*100)+E14-(G14*500)-(I14*50)+O14)","v":-90000},{"$f":"IF(E14=0,\"\",RANK(M14,M13:M15))","v":""},null,{"$f":"IF(D14=\"\",\"\",D14)","v":""},null,2,{"$f":"D13","v":""},{"$f":"D15","v":""},null,null,null,null,null,null,null,{"$f":"IF(Z14+AA14>0,1,0)","v":0},{"$f":"IF(Z14>AA14,1,0)","v":0},{"$f":"IF(AA14>Z14,1,0)","v":0},null,null,null,null,null,{"$f":"IFERROR(LARGE(V14:Y14,1),\"\")","v":""},"",{"$f":"IFERROR(LARGE(AF14:AI14,1),\"\")","v":""},"",{"$f":"IF(V14>0,1)+IF(W14>0,1)+IF(X14>0,1)+IF(Y14>0,1)","v":0},{"$f":"IF(AF14>0,1)+IF(AG14>0,1)+IF(AH14>0,1)+IF(AI14>0,1)","v":0}]
[null,"C3",{"$f":"IF(AND(Spieler!$AG$1=\"X\",Spieler!$S$12<21),\"\",'2. Runde Gruppen'!B15)","v":""},{"$f":"IFERROR(IF(C3=\"\",\"\",IF(AND(Spieler!AG1=\"X\",Spieler!AG2<21),\"\",VLOOKUP(B15,Berechnung!$CP$90:$CQ$101,2,FALSE))),\"\")","v":""},{"$f":"AB14+AB15","v":0},{"$f":"AD14+AD15","v":0},{"$f":"AC14+AC15","v":0},{"$f":"AA14+AA15","v":0},{"$f":"Z14+Z15","v":0},null,null,null,{"$f":"IF(D15=\"\",(-90000),(F15*1000)+(H15*100)+E15-(G15*500)-(I15*50)+O15)","v":-90000},{"$f":"IF(E15=0,\"\",RANK(M15,M13:M15))","v":""},null,{"$f":"IF(D15=\"\",\"\",D15)","v":""},null,3,{"$f":"D14","v":""},{"$f":"D15","v":""},null,null,null,null,null,null,null,{"$f":"IF(Z15+AA15>0,1,0)","v":0},{"$f":"IF(Z15>AA15,1,0)","v":0},{"$f":"IF(AA15>Z15,1,0)","v":0},null,null,null,null,null,{"$f":"IFERROR(LARGE(V15:Y15,1),\"\")","v":""},"",{"$f":"IFERROR(LARGE(AF15:AI15,1),\"\")","v":""},"",{"$f":"IF(V15>0,1)+IF(W15>0,1)+IF(X15>0,1)+IF(Y15>0,1)","v":0},{"$f":"IF(AF15>0,1)+IF(AG15>0,1)+IF(AH15>0,1)+IF(AI15>0,1)","v":0}]
[]
["D",null,"R2","Spieler","M","W","L","F+","F-",null,null,null,"Rang","Rang","P+",null,null,null,"Spieler","Spieler",null,"Breaks 30+",null,null,null,"F+","F-",null,null,null,null,"Breaks 30+"]
[null,"D1",{"$f":"IF(AND(Spieler!$AG$1=\"X\",Spieler!$S$12<21),\"\",'2. Runde Gruppen'!B18)","v":""},{"$f":"IFERROR(IF(C3=\"\",\"\",IF(AND(Spieler!AG1=\"X\",Spieler!AG2<21),\"\",VLOOKUP(B18,Berechnung!$CP$90:$CQ$101,2,FALSE))),\"\")","v":""},{"$f":"AB18+AB19","v":0},{"$f":"AC18+AC19","v":0},{"$f":"AD18+AD19","v":0},{"$f":"Z18+Z19","v":0},{"$f":"AA18+AA19","v":0},null,null,null,{"$f":"IF(D18=\"\",(-90000),(F18*1000)+(H18*100)+E18-(G18*500)-(I18*50)+O18)","v":-90000},{"$f":"IF(E18=0,\"\",RANK(M18,M18:M20))","v":""},null,{"$f":"IF(D18=\"\",\"\",D18)","v":""},null,1,{"$f":"D18","v":""},{"$f":"D19","v":""},null,null,null,null,null,null,null,{"$f":"IF(Z18+AA18>0,1,0)","v":0},{"$f":"IF(Z18>AA18,1,0)","v":0},{"$f":"IF(AA18>Z18,1,0)","v":0},null,null,null,null,null,{"$f":"IFERROR(LARGE(V18:Y18,1),\"\")","v":""},"",{"$f":"IFERROR(LARGE(AF18:AI18,1),\"\")","v":""},"",{"$f":"IF(V18>0,1)+IF(W18>0,1)+IF(X18>0,1)+IF(Y18>0,1)","v":0},{"$f":"IF(AF18>0,1)+IF(AG18>0,1)+IF(AH18>0,1)+IF(AI18>0,1)","v":0}]
[null,"D2",{"$f":"IF(AND(Spieler!$AG$1=\"X\",Spieler!$S$12<21),\"\",'2. Runde Gruppen'!B19)","v":""},{"$f":"IFERROR(IF(C3=\"\",\"\",IF(AND(Spieler!AG1=\"X\",Spieler!AG2<21),\"\",VLOOKUP(B19,Berechnung!$CP$90:$CQ$101,2,FALSE))),\"\")","v":""},{"$f":"AB18+AB20","v":0},{"$f":"AD18+AC20","v":0},{"$f":"AC18+AD20","v":0},{"$f":"AA18+Z20","v":0},{"$f":"Z18+AA20","v":0},null,null,null,{"$f":"IF(D19=\"\",(-90000),(F19*1000)+(H19*100)+E19-(G19*500)-(I19*50)+O19)","v":-90000},{"$f":"IF(E19=0,\"\",RANK(M19,M18:M20))","v":""},null,{"$f":"IF(D19=\"\",\"\",D19)","v":""},null,2,{"$f":"D18","v":""},{"$f":"D20","v":""},null,null,null,null,null,null,null,{"$f":"IF(Z19+AA19>0,1,0)","v":0},{"$f":"IF(Z19>AA19,1,0)","v":0},{"$f":"IF(AA19>Z19,1,0)","v":0},null,null,null,null,null,{"$f":"IFERROR(LARGE(V19:Y19,1),\"\")","v":""},"",{"$f":"IFERROR(LARGE(AF19:AI19,1),\"\")","v":""},"",{"$f":"IF(V19>0,1)+IF(W19>0,1)+IF(X19>0,1)+IF(Y19>0,1)","v":0},{"$f":"IF(AF19>0,1)+IF(AG19>0,1)+IF(AH19>0,1)+IF(AI19>0,1)","v":0}]
[null,"D3",{"$f":"IF(AND(Spieler!$AG$1=\"X\",Spieler!$S$12<21),\"\",'2. Runde Gruppen'!B20)","v":""},{"$f":"IFERROR(IF(C3=\"\",\"\",IF(AND(Spieler!AG1=\"X\",Spieler!AG2<21),\"\",VLOOKUP(B20,Berechnung!$CP$90:$CQ$101,2,FALSE))),\"\")","v":""},{"$f":"AB19+AB20","v":0},{"$f":"AD19+AD20","v":0},{"$f":"AC19+AC20","v":0},{"$f":"AA19+AA20","v":0},{"$f":"Z19+Z20","v":0},null,null,null,{"$f":"IF(D20=\"\",(-90000),(F20*1000)+(H20*100)+E20-(G20*500)-(I20*50)+O20)","v":-90000},{"$f":"IF(E20=0,\"\",RANK(M20,M18:M20))","v":""},null,{"$f":"IF(D20=\"\",\"\",D20)","v":""},null,3,{"$f":"D19","v":""},{"$f":"D20","v":""},null,null,null,null,null,null,null,{"$f":"IF(Z20+AA20>0,1,0)","v":0},{"$f":"IF(Z20>AA20,1,0)","v":0},{"$f":"IF(AA20>Z20,1,0)","v":0},null,null,null,null,null,{"$f":"IFERROR(LARGE(V20:Y20,1),\"\")","v":""},"",{"$f":"IFERROR(LARGE(AF20:AI20,1),\"\")","v":""},"",{"$f":"IF(V20>0,1)+IF(W20>0,1)+IF(X20>0,1)+IF(Y20>0,1)","v":0},{"$f":"IF(AF20>0,1)+IF(AG20>0,1)+IF(AH20>0,1)+IF(AI20>0,1)","v":0}]
[null,null,null,null,null,null,null,null,null,null,null,null,null,null,null,null,null,null,null,null,null,null,null,null,null,null,null,null,null,null,null,null,null,null,null,{"$f":"IFERROR(LARGE(AJ3:AJ20,1),0)","v":0},null,{"$f":"IFERROR(LARGE(AL3:AL20,1),0)","v":0},null,{"$f":"SUM(AN3:AN20)","v":0},{"$f":"SUM(AO3:AO20)","v":0}]
[]
[null,null,null,null,null,null,null,null,null,null,null,null,null,null,null,null,null,null,null,null,null,null,null,null,null,{"$f":"SUM(Z3:AA20)","v":0},null,null,null,null,null,null,null,null,"HB",{"$f":"IFERROR(IF(AND(AJ21=0,AL21=0),\"\",IF(AJ21>AL21,AJ21,AL21)),\"\")","v":""}]
[null,null,null,null,null,null,null,null,null,null,null,null,null,null,null,null,null,null,null,null,null,null,null,null,null,null,null,null,null,null,null,null,null,null,"Anzahl",{"$f":"AN21+AO21","v":0}]
[null,null,null,null,null,null,null,null,null,null,null,null,null,null,null,null,null,null,null,null,null,null,null,null,null,null,null,null,null,null,null,null,null,null,1,{"$f":"IFERROR(VLOOKUP(AJ21,AJ3:AK20,2,FALSE),\"\")","v":""}]
[null,null,null,null,null,null,null,null,null,null,null,null,null,null,null,null,null,null,null,null,null,null,null,null,null,null,null,null,null,null,null,null,null,null,2,{"$f":"IFERROR(VLOOKUP(AL21,AL3:AM20,2,FALSE),\"\")","v":""}]
[null,null,null,null,null,null,null,null,null,null,null,null,null,null,null,null,null,null,null,null,null,null,null,null,null,null,null,null,null,null,null,null,null,null,"HB",{"$f":"IFERROR(IF(AND(AJ21=0,AL21=0),\"\",IF(AJ21>AL21,AJ25,AJ26)),\"\")","v":""}]

{"sheet":"Finals","index":6,"n_rows":65,"n_cols":39,"rows_kept":65,"cut":false,"hidden":false,"merged":[[3,0,4,0],[0,31,0,36],[6,0,7,0],[9,0,10,0],[12,0,13,0],[8,25,8,29],[1,18,1,20],[1,11,1,13],[0,1,0,29],[3,24,3,29],[5,24,5,29],[7,24,7,29],[4,25,4,29],[6,25,6,29],[4,11,4,13],[10,11,10,13],[11,7,12,7],[1,3,1,5],[9,14,10,14],[1,24,2,29],[1,21,2,23],[8,18,8,20],[5,7,6,7],[25,16,25,20],[32,1,33,28],[24,16,24,20],[24,0,25,0],[12,25,12,28],[21,25,21,28],[21,11,21,13],[15,0,16,0],[18,0,19,0],[21,0,22,0],[22,7,23,7],[16,7,17,7],[18,14,19,14],[17,18,17,20],[15,11,15,13],[28,1,31,28]]}
[{"$f":"Spieler!S12","v":0},"Finals - Drei Länder Ranking - GST Serie",null,null,null,null,null,null,null,null,null,null,null,null,null,null,null,null,null,null,null,null,null,null,null,null,null,null,null,null,null,"Ranking",null,null,null,null,null,"Anzahl"]
[{"$f":"Spieler!AG1","v":"X"},"Achtelfinals","Bo3","Break 30+",null,null,null,null,null,"Viertelfinals",null,null,null,null,null,null,null,null,null,null,null,"Platzierung",null,null,"Auswertung",null,null,null,null,null,null,"Pl.","Spieler","Pkt.","Quote %","F+","F-","Breaks 30+"]
[]
[1,{"$f":"IFERROR(Berechnung!N90,\"\")","v":""},0,null,null,null,{"$f":"B4","v":""},null,{"$f":"C5","v":0},null,null,null,null,null,null,null,null,null,null,null,null,"1.",null,{"$f":"IF(Y14=Y15,\"\",IF(Y15>Y14,X15,X14))","v":""},"Highbreak R1",null,null,null,null,null,null,{"$f":"IFERROR(Berechnung!BO116,\"\")","v":""},{"$f":"IFERROR(IF(Spieler!$I$2=\"\",\"\",Berechnung!BP116),\"\")","v":""},{"$f":"IFERROR(IF(Spieler!$S$11=\"SR\",Berechnung!BT116,Berechnung!BQ116+AM4),\"\")","v":""},{"$f":"IFERROR(VLOOKUP(AG4,Berechnung!$D$170:$X$209,21,FALSE),\"\")","v":""},{"$f":"IFERROR(IF(AG4=\"\",\"\",VLOOKUP(AG4,Berechnung!$D$170:$V$209,18,FALSE)),\"\")","v":""},{"$f":"IFERROR(IF(AG4=\"\",\"\",VLOOKUP(AG4,Berechnung!$D$170:$V$209,19,FALSE)),\"\")","v":""},null,{"$f":"AL4*5","v":0}]
[null,{"$f":"IF(AND($A$37=148,$B$37=FALSE),\"\",Berechnung!N105)","v":""},0,null,null,null,{"$f":"B5","v":""},{"$f":"IFERROR(IF(AND($A$1=24,$A$2=\"\"),VLOOKUP(1,'2. Runde Gruppen'!N3:P5,3,FALSE),IF(AND(Spieler!AG1=\"X\",Spieler!S12<21),VLOOKUP(1,'1. Runde Gruppen'!N3:P7,3,FALSE),IF(AND(A1>11,A1<17),VLOOKUP(1,'1. Runde Gruppen'!$N$3:$P$7,3,FALSE),IF(A1=11,VLOOKUP(1,'1. Runde Gruppen'!$N$3:$P$7,3,FALSE),IF(AND($A$1>16,$A$1<24),VLOOKUP(1,'2. Runde Gruppen'!$N$3:$P$5,3,FALSE),IF(C4=C5,\"\",IF(C4>C5,B4,B5))))))),\"\")","v":""},{"$f":"C4","v":0},{"$f":"IF(C4=C5,\"\",IF(C4>C5,B4,B5))","v":""},"Bo3","Break 30+",null,null,null,null,null,null,null,null,null,"2.",null,{"$f":"IF(Y14=Y15,\"\",IF(Y15>Y14,X14,X15))","v":""},{"$f":"Matches!AB85","v":""},{"$f":"Matches!AB84","v":""},null,null,null,null,null,{"$f":"IFERROR(Berechnung!BO117,\"\")","v":""},{"$f":"IFERROR(IF(Spieler!$I$2=\"\",\"\",Berechnung!BP117),\"\")","v":""},{"$f":"IFERROR(IF(Spieler!$S$11=\"SR\",Berechnung!BT117,Berechnung!BQ117+AM5),\"\")","v":""},{"$f":"IFERROR(VLOOKUP(AG5,Berechnung!$D$170:$X$209,21,FALSE),\"\")","v":""},{"$f":"IFERROR(IF(AG5=\"\",\"\",VLOOKUP(AG5,Berechnung!$D$170:$V$209,18,FALSE)),\"\")","v":""},{"$f":"IFERROR(IF(AG5=\"\",\"\",VLOOKUP(AG5,Berechnung!$D$170:$V$209,19,FALSE)),\"\")","v":""},null,{"$f":"AL5*5","v":0}]
[{"$f":"IF(AND(A1>7,A1<11),1,IF(A1=11,2,IF(AND(A1>11,A1<17),3,IF(AND(A1>16,A1<21),4,IF(AND(A1>20,A1<24),5,IF(AND(A1>23,A1<41),6,\"\"))))))","v":""},null,null,null,null,null,null,1,null,{"$f":"IF(A1<24,Berechnung!X90,J5)","v":""},0,null,null,null,{"$f":"J6","v":""},{"$f":"K7","v":0},null,null,null,null,null,"3.",null,{"$f":"IF(X19=\"\",\"\",X19)","v":""},"Highbreak R2",null,null,null,null,null,null,{"$f":"IFERROR(Berechnung!BO118,\"\")","v":""},{"$f":"IFERROR(IF(Spieler!$I$2=\"\",\"\",Berechnung!BP118),\"\")","v":""},{"$f":"IFERROR(IF(Spieler!$S$11=\"SR\",Berechnung!BT118,Berechnung!BQ118+AM6),\"\")","v":""},{"$f":"IFERROR(VLOOKUP(AG6,Berechnung!$D$170:$X$209,21,FALSE),\"\")","v":""},{"$f":"IFERROR(IF(AG6=\"\",\"\",VLOOKUP(AG6,Berechnung!$D$170:$V$209,18,FALSE)),\"\")","v":""},{"$f":"IFERROR(IF(AG6=\"\",\"\",VLOOKUP(AG6,Berechnung!$D$170:$V$209,19,FALSE)),\"\")","v":""},null,0]
[2,{"$f":"IFERROR(Berechnung!N91,\"\")","v":""},0,null,null,null,"",null,{"$f":"C8","v":0},{"$f":"IF(A1<24,Berechnung!X94,J8)","v":""},0,null,null,null,{"$f":"J7","v":""},{"$f":"K6","v":0},null,null,null,null,null,"3.",null,{"$f":"IF(X20=\"\",\"\",X20)","v":""},{"$f":"'2. Runde Gruppen'!AJ23","v":""},{"$f":"'2. Runde Gruppen'!AJ27","v":""},null,null,null,null,null,{"$f":"IFERROR(Berechnung!BO119,\"\")","v":""},{"$f":"IFERROR(IF(Spieler!$I$2=\"\",\"\",Berechnung!BP119),\"\")","v":""},{"$f":"IFERROR(IF(Spieler!$S$11=\"SR\",Berechnung!BT119,Berechnung!BQ119+AM7),\"\")","v":""},{"$f":"IFERROR(VLOOKUP(AG7,Berechnung!$D$170:$X$209,21,FALSE),\"\")","v":""},{"$f":"IFERROR(IF(AG7=\"\",\"\",VLOOKUP(AG7,Berechnung!$D$170:$V$209,18,FALSE)),\"\")","v":""},{"$f":"IFERROR(IF(AG7=\"\",\"\",VLOOKUP(AG7,Berechnung!$D$170:$V$209,19,FALSE)),\"\")","v":""},null,0]
[null,{"$f":"IF(AND($A$37=148,$B$37=FALSE),\"\",Berechnung!N104)","v":""},0,null,null,null,"",{"$f":"IFERROR(IF(AND($A$1=24,$A$2=\"\"),VLOOKUP(2,'2. Runde Gruppen'!N18:P20,3,FALSE),IF(AND(Spieler!AG1=\"X\",Spieler!S12<21),VLOOKUP(2,'1. Runde Gruppen'!AD11:AF15,3,FALSE),IF(AND(A1>11,A1<17),VLOOKUP(2,'1. Runde Gruppen'!$AD$11:$AF$15,3,FALSE),IF(A1=11,VLOOKUP(2,'1. Runde Gruppen'!$N$11:$P$15,3,FALSE),IF(AND($A$1>16,$A$1<24),VLOOKUP(2,'2. Runde Gruppen'!$N$18:$P$20,3,FALSE),IF(C7=C8,\"\",IF(C7>C8,B7,B8))))))),\"\")","v":""},{"$f":"C7","v":0},{"$f":"IF(C7=C8,\"\",IF(C7>C8,B7,B8))","v":""},null,null,null,null,null,null,null,null,null,null,null,null,null,null,"Highbreak Finals",null,null,null,null,null,null,{"$f":"IFERROR(Berechnung!BO120,\"\")","v":""},{"$f":"IFERROR(IF(Spieler!$I$2=\"\",\"\",Berechnung!BP120),\"\")","v":""},{"$f":"IFERROR(IF(Spieler!$S$11=\"SR\",Berechnung!BT120,Berechnung!BQ120+AM8),\"\")","v":""},{"$f":"IFERROR(VLOOKUP(AG8,Berechnung!$D$170:$X$209,21,FALSE),\"\")","v":""},{"$f":"IFERROR(IF(AG8=\"\",\"\",VLOOKUP(AG8,Berechnung!$D$170:$V$209,18,FALSE)),\"\")","v":""},{"$f":"IFERROR(IF(AG8=\"\",\"\",VLOOKUP(AG8,Berechnung!$D$170:$V$209,19,FALSE)),\"\")","v":""},null,0]
[null,null,null,null,null,null,null,null,null,null,null,null,null,null,null,null,"Halbfinale 1","Bo3","Break 30+",null,null,null,null,null,{"$f":"IF(A65=0,\"\",A65)","v":""},{"$f":"B65","v":""},null,null,null,null,null,{"$f":"IFERROR(Berechnung!BO121,\"\")","v":""},{"$f":"IFERROR(IF(Spieler!$I$2=\"\",\"\",Berechnung!BP121),\"\")","v":""},{"$f":"IFERROR(IF(Spieler!$S$11=\"SR\",Berechnung!BT121,Berechnung!BQ121+AM9),\"\")","v":""},{"$f":"IFERROR(VLOOKUP(AG9,Berechnung!$D$170:$X$209,21,FALSE),\"\")","v":""},{"$f":"IFERROR(IF(AG9=\"\",\"\",VLOOKUP(AG9,Berechnung!$D$170:$V$209,18,FALSE)),\"\")","v":""},{"$f":"IFERROR(IF(AG9=\"\",\"\",VLOOKUP(AG9,Berechnung!$D$170:$V$209,19,FALSE)),\"\")","v":""},null,0]
[3,{"$f":"IFERROR(Berechnung!N92,\"\")","v":""},0,null,null,null,"",null,{"$f":"C11","v":0},null,null,null,null,null,1,null,{"$f":"IFERROR(IF(A1<11,VLOOKUP(1,'1. Runde Gruppen'!$N$3:$P$7,3,FALSE),IF(K6=K7,\"\",IF(K6>K7,J6,J7))),\"\")","v":""},0,null,null,null,{"$f":"Q10","v":""},{"$f":"R11","v":0},null,{"$f":"Y52+R52+K52+C52+'2. Runde Gruppen'!Z23+Matches!O83","v":0},"gespielte Frames",null,null,null,null,null,{"$f":"IFERROR(Berechnung!BO122,\"\")","v":""},{"$f":"IFERROR(IF(Spieler!$I$2=\"\",\"\",Berechnung!BP122),\"\")","v":""},{"$f":"IFERROR(IF(Spieler!$S$11=\"SR\",Berechnung!BT122,Berechnung!BQ122+AM10),\"\")","v":""},{"$f":"IFERROR(VLOOKUP(AG10,Berechnung!$D$170:$X$209,21,FALSE),\"\")","v":""},{"$f":"IFERROR(IF(AG10=\"\",\"\",VLOOKUP(AG10,Berechnung!$D$170:$V$209,18,FALSE)),\"\")","v":""},{"$f":"IFERROR(IF(AG10=\"\",\"\",VLOOKUP(AG10,Berechnung!$D$170:$V$209,19,FALSE)),\"\")","v":""},null,0]
[null,{"$f":"IF(AND($A$37=148,$B$37=FALSE),\"\",Berechnung!N103)","v":""},0,null,null,null,"",{"$f":"IFERROR(IF(AND($A$1=24,$A$2=\"\"),VLOOKUP(1,'2. Runde Gruppen'!N8:P10,3,FALSE),IF(AND(Spieler!AG1=\"X\",Spieler!S12<21),VLOOKUP(1,'1. Runde Gruppen'!AD3:AF7,3,FALSE),IF(AND(A1>11,A1<17),VLOOKUP(1,'1. Runde Gruppen'!$AD$3:$AF$7,3,FALSE),IF(A1=11,VLOOKUP(1,'1. Runde Gruppen'!$AD$3:$AF$7,3,FALSE),IF(AND($A$1>16,$A$1<24),VLOOKUP(1,'2. Runde Gruppen'!$N$8:$P$10,3,FALSE),IF(C10=C11,\"\",IF(C10>C11,B10,B11))))))),\"\")","v":""},{"$f":"C10","v":0},{"$f":"IF(C10=C11,\"\",IF(C10>C11,B10,B11))","v":""},{"$f":"K5","v":"Bo3"},"Break 30+",null,null,null,null,{"$f":"IFERROR(IF(A1<11,VLOOKUP(2,'1. Runde Gruppen'!$AD$3:$AF$7,3,FALSE),IF(K12=K13,\"\",IF(K12>K13,J12,J13))),\"\")","v":""},0,null,null,null,{"$f":"Q11","v":""},{"$f":"R10","v":0},null,{"$f":"SUM(Z53+S53+L53+D53+'2. Runde Gruppen'!AJ24+Matches!AD82+Matches!AE82)","v":0},"Breaks 30+",null,null,null,null,null,{"$f":"IFERROR(Berechnung!BO123,\"\")","v":""},{"$f":"IFERROR(IF(Spieler!$I$2=\"\",\"\",Berechnung!BP123),\"\")","v":""},{"$f":"IFERROR(IF(Spieler!$S$11=\"SR\",Berechnung!BT123,Berechnung!BQ123+AM11),\"\")","v":""},{"$f":"IFERROR(VLOOKUP(AG11,Berechnung!$D$170:$X$209,21,FALSE),\"\")","v":""},{"$f":"IFERROR(IF(AG11=\"\",\"\",VLOOKUP(AG11,Berechnung!$D$170:$V$209,18,FALSE)),\"\")","v":""},{"$f":"IFERROR(IF(AG11=\"\",\"\",VLOOKUP(AG11,Berechnung!$D$170:$V$209,19,FALSE)),\"\")","v":""},null,0]
[null,null,null,null,null,null,null,2,null,{"$f":"IF(A1<24,Berechnung!X91,J11)","v":""},0,null,null,null,{"$f":"J12","v":""},{"$f":"K13","v":0},null,null,null,null,null,null,null,null,null,null,null,null,null,null,null,{"$f":"IFERROR(Berechnung!BO124,\"\")","v":""},{"$f":"IFERROR(IF(Spieler!$I$2=\"\",\"\",Berechnung!BP124),\"\")","v":""},{"$f":"IFERROR(IF(Spieler!$S$11=\"SR\",Berechnung!BT124,Berechnung!BQ124+AM12),\"\")","v":""},{"$f":"IFERROR(VLOOKUP(AG12,Berechnung!$D$170:$X$209,21,FALSE),\"\")","v":""},{"$f":"IFERROR(IF(AG12=\"\",\"\",VLOOKUP(AG12,Berechnung!$D$170:$V$209,18,FALSE)),\"\")","v":""},{"$f":"IFERROR(IF(AG12=\"\",\"\",VLOOKUP(AG12,Berechnung!$D$170:$V$209,19,FALSE)),\"\")","v":""},null,0]
[4,{"$f":"IFERROR(Berechnung!N93,\"\")","v":""},0,null,null,null,"",null,{"$f":"C14","v":0},{"$f":"IF(A1<24,Berechnung!X95,J14)","v":""},0,null,null,null,{"$f":"J13","v":""},{"$f":"K12","v":0},null,null,null,null,null,null,null,"Finale","Bo3/5","Break 30+",null,null,null,null,null,{"$f":"IFERROR(Berechnung!BO125,\"\")","v":""},{"$f":"IFERROR(IF(Spieler!$I$2=\"\",\"\",Berechnung!BP125),\"\")","v":""},{"$f":"IFERROR(IF(Spieler!$S$11=\"SR\",Berechnung!BT125,Berechnung!BQ125+AM13),\"\")","v":""},{"$f":"IFERROR(VLOOKUP(AG13,Berechnung!$D$170:$X$209,21,FALSE),\"\")","v":""},{"$f":"IFERROR(IF(AG13=\"\",\"\",VLOOKUP(AG13,Berechnung!$D$170:$V$209,18,FALSE)),\"\")","v":""},{"$f":"IFERROR(IF(AG13=\"\",\"\",VLOOKUP(AG13,Berechnung!$D$170:$V$209,19,FALSE)),\"\")","v":""},null,0]
[null,{"$f":"IF(AND($A$37=148,$B$37=FALSE),\"\",Berechnung!N102)","v":""},0,null,null,null,"",{"$f":"IFERROR(IF(AND($A$1=24,$A$2=\"\"),VLOOKUP(2,'2. Runde Gruppen'!N13:P15,3,FALSE),IF(AND(Spieler!AG1=\"X\",Spieler!S12<21),VLOOKUP(2,'1. Runde Gruppen'!N11:P15,3,FALSE),IF(AND(A1>11,A1<17),VLOOKUP(2,'1. Runde Gruppen'!$N$11:$P$15,3,FALSE),IF(A1=11,VLOOKUP(3,'1. Runde Gruppen'!$N$3:$P$7,3,FALSE),IF(AND($A$1>16,$A$1<24),VLOOKUP(2,'2. Runde Gruppen'!$N$13:$P$15,3,FALSE),IF(C13=C14,\"\",IF(C13>C14,B13,B14))))))),\"\")","v":""},{"$f":"C13","v":0},{"$f":"IF(C13=C14,\"\",IF(C13>C14,B13,B14))","v":""},null,null,null,null,null,null,null,null,null,null,null,null,null,{"$f":"IF(R10=R11,\"\",IF(R10>R11,Q10,Q11))","v":""},0,null,null,null,null,{"$f":"Y15","v":0},{"$f":"X14","v":""},{"$f":"IFERROR(Berechnung!BO126,\"\")","v":""},{"$f":"IFERROR(IF(Spieler!$I$2=\"\",\"\",Berechnung!BP126),\"\")","v":""},{"$f":"IFERROR(IF(Spieler!$S$11=\"SR\",Berechnung!BT126,Berechnung!BQ126+AM14),\"\")","v":""},{"$f":"IFERROR(VLOOKUP(AG14,Berechnung!$D$170:$X$209,21,FALSE),\"\")","v":""},{"$f":"IFERROR(IF(AG14=\"\",\"\",VLOOKUP(AG14,Berechnung!$D$170:$V$209,18,FALSE)),\"\")","v":""},{"$f":"IFERROR(IF(AG14=\"\",\"\",VLOOKUP(AG14,Berechnung!$D$170:$V$209,19,FALSE)),\"\")","v":""},null,0]
[null,null,null,null,null,null,null,null,null,null,null,null,null,null,null,null,null,null,null,null,null,null,null,{"$f":"IF(R19=R20,\"\",IF(R19>R20,Q19,Q20))","v":""},0,null,null,null,null,{"$f":"Y14","v":0},{"$f":"X15","v":""},{"$f":"IFERROR(Berechnung!BO127,\"\")","v":""},{"$f":"IFERROR(IF(Spieler!$I$2=\"\",\"\",Berechnung!BP127),\"\")","v":""},{"$f":"IFERROR(IF(Spieler!$S$11=\"SR\",Berechnung!BT127,Berechnung!BQ127+AM15),\"\")","v":""},{"$f":"IFERROR(VLOOKUP(AG15,Berechnung!$D$170:$X$209,21,FALSE),\"\")","v":""},{"$f":"IFERROR(IF(AG15=\"\",\"\",VLOOKUP(AG15,Berechnung!$D$170:$V$209,18,FALSE)),\"\")","v":""},{"$f":"IFERROR(IF(AG15=\"\",\"\",VLOOKUP(AG15,Berechnung!$D$170:$V$209,19,FALSE)),\"\")","v":""},null,0]
[5,{"$f":"IFERROR(Berechnung!N94,\"\")","v":""},0,null,null,null,"",{"$f":"IFERROR(IF(AND($A$1=24,$A$2=\"\"),VLOOKUP(1,'2. Runde Gruppen'!N13:P15,3,FALSE),IF(AND(Spieler!AG1=\"X\",Spieler!S12<21),VLOOKUP(1,'1. Runde Gruppen'!N11:P15,3,FALSE),IF(AND(A1>11,A1<17),VLOOKUP(1,'1. Runde Gruppen'!$N$11:$P$15,3,FALSE),IF(A1=11,VLOOKUP(1,'1. Runde Gruppen'!$N$11:$P$15,3,FALSE),IF(AND($A$1>16,$A$1<24),VLOOKUP(1,'2. Runde Gruppen'!$N$13:$P$15,3,FALSE),IF(C16=C17,\"\",IF(C16>C17,B16,B17))))))),\"\")","v":""},{"$f":"C17","v":0},{"$f":"IF(C16=C17,\"\",IF(C16>C17,B16,B17))","v":""},{"$f":"K5","v":"Bo3"},"Break 30+",null,null,null,null,null,null,null,null,null,null,null,null,null,null,null,null,null,null,null,{"$f":"IFERROR(Berechnung!BO128,\"\")","v":""},{"$f":"IFERROR(IF(Spieler!$I$2=\"\",\"\",Berechnung!BP128),\"\")","v":""},{"$f":"IFERROR(IF(Spieler!$S$11=\"SR\",Berechnung!BT128,Berechnung!BQ128+AM16),\"\")","v":""},{"$f":"IFERROR(VLOOKUP(AG16,Berechnung!$D$170:$X$209,21,FALSE),\"\")","v":""},{"$f":"IFERROR(IF(AG16=\"\",\"\",VLOOKUP(AG16,Berechnung!$D$170:$V$209,18,FALSE)),\"\")","v":""},{"$f":"IFERROR(IF(AG16=\"\",\"\",VLOOKUP(AG16,Berechnung!$D$170:$V$209,19,FALSE)),\"\")","v":""},null,0]
[null,{"$f":"IF(AND($A$37=148,$B$37=FALSE),\"\",Berechnung!N101)","v":""},0,null,null,null,"",3,{"$f":"C16","v":0},{"$f":"IF(A1<24,Berechnung!X92,J16)","v":""},0,null,null,null,{"$f":"J17","v":""},{"$f":"K18","v":0},null,null,null,null,null,null,null,null,null,null,null,null,null,null,null,{"$f":"IFERROR(Berechnung!BO129,\"\")","v":""},{"$f":"IFERROR(IF(Spieler!$I$2=\"\",\"\",Berechnung!BP129),\"\")","v":""},{"$f":"IFERROR(IF(Spieler!$S$11=\"SR\",Berechnung!BT129,Berechnung!BQ129+AM17),\"\")","v":""},{"$f":"IFERROR(VLOOKUP(AG17,Berechnung!$D$170:$X$209,21,FALSE),\"\")","v":""},{"$f":"IFERROR(IF(AG17=\"\",\"\",VLOOKUP(AG17,Berechnung!$D$170:$V$209,18,FALSE)),\"\")","v":""},{"$f":"IFERROR(IF(AG17=\"\",\"\",VLOOKUP(AG17,Berechnung!$D$170:$V$209,19,FALSE)),\"\")","v":""},null,0]
[null,null,null,null,null,null,null,null,null,{"$f":"IF(A1<24,Berechnung!X96,J19)","v":""},0,null,null,null,{"$f":"J18","v":""},{"$f":"K17","v":0},"Halbfinale 2",{"$f":"R9","v":"Bo3"},"Break 30+",null,null,null,null,null,null,null,null,null,null,null,null,{"$f":"IFERROR(Berechnung!BO130,\"\")","v":""},{"$f":"IFERROR(IF(Spieler!$I$2=\"\",\"\",Berechnung!BP130),\"\")","v":""},{"$f":"IFERROR(IF(Spieler!$S$11=\"SR\",Berechnung!BT130,Berechnung!BQ130+AM18),\"\")","v":""},{"$f":"IFERROR(VLOOKUP(AG18,Berechnung!$D$170:$X$209,21,FALSE),\"\")","v":""},{"$f":"IFERROR(IF(AG18=\"\",\"\",VLOOKUP(AG18,Berechnung!$D$170:$V$209,18,FALSE)),\"\")","v":""},{"$f":"IFERROR(IF(AG18=\"\",\"\",VLOOKUP(AG18,Berechnung!$D$170:$V$209,19,FALSE)),\"\")","v":""},null,0]
[6,{"$f":"IFERROR(Berechnung!N95,\"\")","v":""},0,null,null,null,"",{"$f":"IFERROR(IF(AND($A$1=24,$A$2=\"\"),VLOOKUP(2,'2. Runde Gruppen'!N8:P10,3,FALSE),IF(AND(Spieler!AG1=\"X\",Spieler!S12<21),VLOOKUP(2,'1. Runde Gruppen'!AD3:AF7,3,FALSE),IF(AND(A1>11,A1<17),VLOOKUP(2,'1. Runde Gruppen'!$AD$3:$AF$7,3,FALSE),IF(A1=11,VLOOKUP(3,'1. Runde Gruppen'!$AD$3:$AF$7,3,FALSE),IF(AND($A$1>16,$A$1<24),VLOOKUP(2,'2. Runde Gruppen'!$N$8:$P$10,3,FALSE),IF(C19=C20,\"\",IF(C19>C20,B19,B20))))))),\"\")","v":""},{"$f":"C20","v":0},{"$f":"IF(C19=C20,\"\",IF(C19>C20,B19,B20))","v":""},null,null,null,null,2,null,{"$f":"IFERROR(IF(A1<11,VLOOKUP(1,'1. Runde Gruppen'!$AD$3:$AF$7,3,FALSE),IF(K17=K18,\"\",IF(K17>K18,J17,J18))),\"\")","v":""},0,null,null,null,{"$f":"Q19","v":""},{"$f":"R20","v":0},{"$f":"IF(R11<R10,Q11,Q10)","v":""},null,null,null,null,null,null,null,{"$f":"IFERROR(Berechnung!BO131,\"\")","v":""},{"$f":"IFERROR(IF(Spieler!$I$2=\"\",\"\",Berechnung!BP131),\"\")","v":""},{"$f":"IFERROR(IF(Spieler!$S$11=\"SR\",Berechnung!BT131,Berechnung!BQ131+AM19),\"\")","v":""},{"$f":"IFERROR(VLOOKUP(AG19,Berechnung!$D$170:$X$209,21,FALSE),\"\")","v":""},{"$f":"IFERROR(IF(AG19=\"\",\"\",VLOOKUP(AG19,Berechnung!$D$170:$V$209,18,FALSE)),\"\")","v":""},{"$f":"IFERROR(IF(AG19=\"\",\"\",VLOOKUP(AG19,Berechnung!$D$170:$V$209,19,FALSE)),\"\")","v":""},null,0]
[null,{"$f":"IF(AND($A$37=148,$B$37=FALSE),\"\",Berechnung!N100)","v":""},0,null,null,null,"",null,{"$f":"C19","v":0},null,null,null,null,null,null,null,{"$f":"IFERROR(IF(A1<11,VLOOKUP(2,'1. Runde Gruppen'!$N$3:$P$7,3,FALSE),IF(K23=K24,\"\",IF(K23>K24,J23,J24))),\"\")","v":""},0,null,null,null,{"$f":"Q20","v":""},{"$f":"R19","v":0},{"$f":"IF(R20<R19,Q20,Q19)","v":""},null,null,null,null,null,null,null,{"$f":"IFERROR(Berechnung!BO132,\"\")","v":""},{"$f":"IFERROR(IF(Spieler!$I$2=\"\",\"\",Berechnung!BP132),\"\")","v":""},{"$f":"IFERROR(IF(Spieler!$S$11=\"SR\",Berechnung!BT132,Berechnung!BQ132+AM20),\"\")","v":""},{"$f":"IFERROR(VLOOKUP(AG20,Berechnung!$D$170:$X$209,21,FALSE),\"\")","v":""},{"$f":"IFERROR(IF(AG20=\"\",\"\",VLOOKUP(AG20,Berechnung!$D$170:$V$209,18,FALSE)),\"\")","v":""},{"$f":"IFERROR(IF(AG20=\"\",\"\",VLOOKUP(AG20,Berechnung!$D$170:$V$209,19,FALSE)),\"\")","v":""},null,0]
[null,null,null,null,null,null,null,null,null,null,null,null,null,null,null,null,null,null,null,null,null,null,null,null,null,null,null,null,null,null,null,{"$f":"IFERROR(Berechnung!BO133,\"\")","v":""},{"$f":"IFERROR(IF(Spieler!$I$2=\"\",\"\",Berechnung!BP133),\"\")","v":""},{"$f":"IFERROR(IF(Spieler!$S$11=\"SR\",Berechnung!BT133,Berechnung!BQ133+AM21),\"\")","v":""},{"$f":"IFERROR(VLOOKUP(AG21,Berechnung!$D$170:$X$209,21,FALSE),\"\")","v":""},{"$f":"IFERROR(IF(AG21=\"\",\"\",VLOOKUP(AG21,Berechnung!$D$170:$V$209,18,FALSE)),\"\")","v":""},{"$f":"IFERROR(IF(AG21=\"\",\"\",VLOOKUP(AG21,Berechnung!$D$170:$V$209,19,FALSE)),\"\")","v":""},null,0]
[7,{"$f":"IFERROR(Berechnung!N96,\"\")","v":""},0,null,null,null,"",{"$f":"IFERROR(IF(AND($A$1=24,$A$2=\"\"),VLOOKUP(1,'2. Runde Gruppen'!N18:P20,3,FALSE),IF(AND(Spieler!AG1=\"X\",Spieler!S12<21),VLOOKUP(1,'1. Runde Gruppen'!AD11:AF15,3,FALSE),IF(AND(A1>11,A1<17),VLOOKUP(1,'1. Runde Gruppen'!$AD$11:$AF$15,3,FALSE),IF(A1=11,VLOOKUP(2,'1. Runde Gruppen'!$N$3:$P$7,3,FALSE),IF(AND($A$1>16,$A$1<24),VLOOKUP(1,'2. Runde Gruppen'!$N$18:$P$20,3,FALSE),IF(C22=C23,\"\",IF(C22>C23,B22,B23))))))),\"\")","v":""},{"$f":"C23","v":0},{"$f":"IF(C22=C23,\"\",IF(C22>C23,B22,B23))","v":""},{"$f":"K5","v":"Bo3"},"Break 30+",null,null,null,null,null,null,null,null,null,null,null,null,null,null,null,null,null,null,null,{"$f":"IFERROR(Berechnung!BO134,\"\")","v":""},{"$f":"IFERROR(IF(Spieler!$I$2=\"\",\"\",Berechnung!BP134),\"\")","v":""},{"$f":"IFERROR(IF(Spieler!$S$11=\"SR\",Berechnung!BT134,Berechnung!BQ134+AM22),\"\")","v":""},{"$f":"IFERROR(VLOOKUP(AG22,Berechnung!$D$170:$X$209,21,FALSE),\"\")","v":""},{"$f":"IFERROR(IF(AG22=\"\",\"\",VLOOKUP(AG22,Berechnung!$D$170:$V$209,18,FALSE)),\"\")","v":""},{"$f":"IFERROR(IF(AG22=\"\",\"\",VLOOKUP(AG22,Berechnung!$D$170:$V$209,19,FALSE)),\"\")","v":""},null,0]
[null,{"$f":"IF(AND($A$37=148,$B$37=FALSE),\"\",Berechnung!N99)","v":""},0,null,null,null,"",4,{"$f":"C22","v":0},{"$f":"IF(A1<24,Berechnung!X93,J22)","v":""},0,null,null,null,{"$f":"J23","v":""},{"$f":"K24","v":0},null,null,null,null,null,null,null,null,null,null,null,null,null,null,{"$f":"X23","v":0},{"$f":"IFERROR(Berechnung!BO135,\"\")","v":""},{"$f":"IFERROR(IF(Spieler!$I$2=\"\",\"\",Berechnung!BP135),\"\")","v":""},{"$f":"IFERROR(IF(Spieler!$S$11=\"SR\",Berechnung!BT135,Berechnung!BQ135+AM23),\"\")","v":""},{"$f":"IFERROR(VLOOKUP(AG23,Berechnung!$D$170:$X$209,21,FALSE),\"\")","v":""},{"$f":"IFERROR(IF(AG23=\"\",\"\",VLOOKUP(AG23,Berechnung!$D$170:$V$209,18,FALSE)),\"\")","v":""},{"$f":"IFERROR(IF(AG23=\"\",\"\",VLOOKUP(AG23,Berechnung!$D$170:$V$209,19,FALSE)),\"\")","v":""},null,0]
[null,null,null,null,null,null,null,null,null,{"$f":"IF(A1<24,Berechnung!X97,J25)","v":""},0,null,null,null,{"$f":"J24","v":""},{"$f":"K23","v":0},null,null,null,null,null,null,null,null,null,null,null,null,null,null,{"$f":"X24","v":0},{"$f":"IFERROR(Berechnung!BO136,\"\")","v":""},{"$f":"IFERROR(IF(Spieler!$I$2=\"\",\"\",Berechnung!BP136),\"\")","v":""},{"$f":"IFERROR(IF(Spieler!$S$11=\"SR\",Berechnung!BT136,Berechnung!BQ136+AM24),\"\")","v":""},{"$f":"IFERROR(VLOOKUP(AG24,Berechnung!$D$170:$X$209,21,FALSE),\"\")","v":""},{"$f":"IFERROR(IF(AG24=\"\",\"\",VLOOKUP(AG24,Berechnung!$D$170:$V$209,18,FALSE)),\"\")","v":""},{"$f":"IFERROR(IF(AG24=\"\",\"\",VLOOKUP(AG24,Berechnung!$D$170:$V$209,19,FALSE)),\"\")","v":""},null,0]
[8,{"$f":"IFERROR(Berechnung!N97,\"\")","v":""},0,null,null,null,"",{"$f":"IFERROR(IF(AND($A$1=24,$A$2=\"\"),VLOOKUP(2,'2. Runde Gruppen'!N3:P5,3,FALSE),IF(AND(Spieler!AG1=\"X\",Spieler!S12<21),VLOOKUP(2,'1. Runde Gruppen'!N3:P7,3,FALSE),IF(AND(A1>11,A1<17),VLOOKUP(2,'1. Runde Gruppen'!$N$3:$P$7,3,FALSE),IF(A1=11,VLOOKUP(2,'1. Runde Gruppen'!$AD$3:$AF$7,3,FALSE),IF(AND($A$1>16,$A$1<24),VLOOKUP(2,'2. Runde Gruppen'!$N$3:$P$5,3,FALSE),IF(C25=C26,\"\",IF(C25>C26,B25,B26))))))),\"\")","v":""},{"$f":"C26","v":0},{"$f":"IF(C25=C26,\"\",IF(C25>C26,B25,B26))","v":""},null,null,null,null,null,null,"speichert unter C:\\Users\\Public\\Videos",null,null,null,null,null,null,null,null,null,null,null,null,null,null,{"$f":"IFERROR(Berechnung!BO137,\"\")","v":""},{"$f":"IFERROR(IF(Spieler!$I$2=\"\",\"\",Berechnung!BP137),\"\")","v":""},{"$f":"IFERROR(IF(Spieler!$S$11=\"SR\",Berechnung!BT137,Berechnung!BQ137+AM25),\"\")","v":""},{"$f":"IFERROR(VLOOKUP(AG25,Berechnung!$D$170:$X$209,21,FALSE),\"\")","v":""},{"$f":"IFERROR(IF(AG25=\"\",\"\",VLOOKUP(AG25,Berechnung!$D$170:$V$209,18,FALSE)),\"\")","v":""},{"$f":"IFERROR(IF(AG25=\"\",\"\",VLOOKUP(AG25,Berechnung!$D$170:$V$209,19,FALSE)),\"\")","v":""},null,0]
[null,{"$f":"IF(AND($A$37=148,$B$37=FALSE),\"\",Berechnung!N98)","v":""},0,null,null,null,"",null,{"$f":"C25","v":0},null,null,null,null,null,null,null,{"$f":"NOW()-TODAY()","v":"13:34:06.850"},null,null,null,null,null,null,null,null,null,null,null,null,null,null,{"$f":"IFERROR(Berechnung!BO138,\"\")","v":""},{"$f":"IFERROR(IF(Spieler!$I$2=\"\",\"\",Berechnung!BP138),\"\")","v":""},{"$f":"IFERROR(IF(Spieler!$S$11=\"SR\",Berechnung!BT138,Berechnung!BQ138+AM26),\"\")","v":""},{"$f":"IFERROR(VLOOKUP(AG26,Berechnung!$D$170:$X$209,21,FALSE),\"\")","v":""},{"$f":"IFERROR(IF(AG26=\"\",\"\",VLOOKUP(AG26,Berechnung!$D$170:$V$209,18,FALSE)),\"\")","v":""},{"$f":"IFERROR(IF(AG26=\"\",\"\",VLOOKUP(AG26,Berechnung!$D$170:$V$209,19,FALSE)),\"\")","v":""},null,0]
[null,null,null,null,null,null,null,null,null,null,null,null,null,null,null,null,null,null,null,null,null,null,null,null,null,null,null,null,null,null,null,{"$f":"IFERROR(Berechnung!BO139,\"\")","v":""},{"$f":"IFERROR(IF(Spieler!$I$2=\"\",\"\",Berechnung!BP139),\"\")","v":""},{"$f":"IFERROR(IF(Spieler!$S$11=\"SR\",Berechnung!BT139,Berechnung!BQ139+AM27),\"\")","v":""},{"$f":"IFERROR(VLOOKUP(AG27,Berechnung!$D$170:$X$209,21,FALSE),\"\")","v":""},{"$f":"IFERROR(IF(AG27=\"\",\"\",VLOOKUP(AG27,Berechnung!$D$170:$V$209,18,FALSE)),\"\")","v":""},{"$f":"IFERROR(IF(AG27=\"\",\"\",VLOOKUP(AG27,Berechnung!$D$170:$V$209,19,FALSE)),\"\")","v":""},null,0]
[null,null,null,null,null,null,null,null,null,null,null,null,null,null,null,null,null,null,null,null,null,null,null,null,null,null,null,null,null,null,null,{"$f":"IFERROR(Berechnung!BO140,\"\")","v":""},{"$f":"IFERROR(IF(Spieler!$I$2=\"\",\"\",Berechnung!BP140),\"\")","v":""},{"$f":"IFERROR(IF(Spieler!$S$11=\"SR\",Berechnung!BT140,Berechnung!BQ140+AM28),\"\")","v":""},{"$f":"IFERROR(VLOOKUP(AG28,Berechnung!$D$170:$X$209,21,FALSE),\"\")","v":""},{"$f":"IFERROR(IF(AG28=\"\",\"\",VLOOKUP(AG28,Berechnung!$D$170:$V$209,18,FALSE)),\"\")","v":""},{"$f":"IFERROR(IF(AG28=\"\",\"\",VLOOKUP(AG28,Berechnung!$D$170:$V$209,19,FALSE)),\"\")","v":""},null,0]
[null,"Next Target: ",null,null,null,null,null,null,null,null,null,null,null,null,null,null,null,null,null,null,null,null,null,null,null,null,null,null,null,null,null,{"$f":"IFERROR(Berechnung!BO141,\"\")","v":""},{"$f":"IFERROR(IF(Spieler!$I$2=\"\",\"\",Berechnung!BP141),\"\")","v":""},{"$f":"IFERROR(IF(Spieler!$S$11=\"SR\",Berechnung!BT141,Berechnung!BQ141+AM29),\"\")","v":""},{"$f":"IFERROR(VLOOKUP(AG29,Berechnung!$D$170:$X$209,21,FALSE),\"\")","v":""},{"$f":"IFERROR(IF(AG29=\"\",\"\",VLOOKUP(AG29,Berechnung!$D$170:$V$209,18,FALSE)),\"\")","v":""},{"$f":"IFERROR(IF(AG29=\"\",\"\",VLOOKUP(AG29,Berechnung!$D$170:$V$209,19,FALSE)),\"\")","v":""},null,0]
[null,null,null,null,null,null,null,null,null,null,null,null,null,null,null,null,null,null,null,null,null,null,null,null,null,null,null,null,null,null,null,{"$f":"IFERROR(Berechnung!BO142,\"\")","v":""},{"$f":"IFERROR(IF(Spieler!$I$2=\"\",\"\",Berechnung!BP142),\"\")","v":""},{"$f":"IFERROR(IF(Spieler!$S$11=\"SR\",Berechnung!BT142,Berechnung!BQ142+AM30),\"\")","v":""},{"$f":"IFERROR(VLOOKUP(AG30,Berechnung!$D$170:$X$209,21,FALSE),\"\")","v":""},{"$f":"IFERROR(IF(AG30=\"\",\"\",VLOOKUP(AG30,Berechnung!$D$170:$V$209,18,FALSE)),\"\")","v":""},{"$f":"IFERROR(IF(AG30=\"\",\"\",VLOOKUP(AG30,Berechnung!$D$170:$V$209,19,FALSE)),\"\")","v":""},null,0]
[null,null,null,null,null,null,null,null,null,null,null,null,null,null,null,null,null,null,null,null,null,null,null,null,null,null,null,null,null,null,null,{"$f":"IFERROR(Berechnung!BO143,\"\")","v":""},{"$f":"IFERROR(IF(Spieler!$I$2=\"\",\"\",Berechnung!BP143),\"\")","v":""},{"$f":"IFERROR(IF(Spieler!$S$11=\"SR\",Berechnung!BT143,Berechnung!BQ143+AM31),\"\")","v":""},{"$f":"IFERROR(VLOOKUP(AG31,Berechnung!$D$170:$X$209,21,FALSE),\"\")","v":""},{"$f":"IFERROR(IF(AG31=\"\",\"\",VLOOKUP(AG31,Berechnung!$D$170:$V$209,18,FALSE)),\"\")","v":""},{"$f":"IFERROR(IF(AG31=\"\",\"\",VLOOKUP(AG31,Berechnung!$D$170:$V$209,19,FALSE)),\"\")","v":""},null,0]
[null,null,null,null,null,null,null,null,null,null,null,null,null,null,null,null,null,null,null,null,null,null,null,null,null,null,null,null,null,null,null,{"$f":"IFERROR(Berechnung!BO144,\"\")","v":""},{"$f":"IFERROR(IF(Spieler!$I$2=\"\",\"\",Berechnung!BP144),\"\")","v":""},{"$f":"IFERROR(IF(Spieler!$S$11=\"SR\",Berechnung!BT144,Berechnung!BQ144+AM32),\"\")","v":""},{"$f":"IFERROR(VLOOKUP(AG32,Berechnung!$D$170:$X$209,21,FALSE),\"\")","v":""},{"$f":"IFERROR(IF(AG32=\"\",\"\",VLOOKUP(AG32,Berechnung!$D$170:$V$209,18,FALSE)),\"\")","v":""},{"$f":"IFERROR(IF(AG32=\"\",\"\",VLOOKUP(AG32,Berechnung!$D$170:$V$209,19,FALSE)),\"\")","v":""},null,0]
[null,"?",null,null,null,null,null,null,null,null,null,null,null,null,null,null,null,null,null,null,null,null,null,null,null,null,null,null,null,null,null,{"$f":"IFERROR(Berechnung!BO145,\"\")","v":""},{"$f":"IFERROR(IF(Spieler!$I$2=\"\",\"\",Berechnung!BP145),\"\")","v":""},{"$f":"IFERROR(IF(Spieler!$S$11=\"SR\",Berechnung!BT145,Berechnung!BQ145+AM33),\"\")","v":""},{"$f":"IFERROR(VLOOKUP(AG33,Berechnung!$D$170:$X$209,21,FALSE),\"\")","v":""},{"$f":"IFERROR(IF(AG33=\"\",\"\",VLOOKUP(AG33,Berechnung!$D$170:$V$209,18,FALSE)),\"\")","v":""},{"$f":"IFERROR(IF(AG33=\"\",\"\",VLOOKUP(AG33,Berechnung!$D$170:$V$209,19,FALSE)),\"\")","v":""},null,0]
[null,null,null,null,null,null,null,null,null,null,null,null,null,null,null,null,null,null,null,null,null,null,null,null,null,null,null,null,null,null,null,{"$f":"IFERROR(Berechnung!BO146,\"\")","v":""},{"$f":"IFERROR(IF(Spieler!$I$2=\"\",\"\",Berechnung!BP146),\"\")","v":""},{"$f":"IFERROR(IF(Spieler!$S$11=\"SR\",Berechnung!BT146,Berechnung!BQ146+AM34),\"\")","v":""},{"$f":"IFERROR(VLOOKUP(AG34,Berechnung!$D$170:$X$209,21,FALSE),\"\")","v":""},{"$f":"IFERROR(IF(AG34=\"\",\"\",VLOOKUP(AG34,Berechnung!$D$170:$V$209,18,FALSE)),\"\")","v":""},{"$f":"IFERROR(IF(AG34=\"\",\"\",VLOOKUP(AG34,Berechnung!$D$170:$V$209,19,FALSE)),\"\")","v":""},null,{"$f":"AL34*5","v":0}]
[null,null,null,null,null,null,null,null,null,null,null,null,null,null,null,null,null,null,null,null,null,null,null,null,null,null,null,null,null,null,null,{"$f":"IFERROR(Berechnung!BO147,\"\")","v":""},{"$f":"IFERROR(IF(Spieler!$I$2=\"\",\"\",Berechnung!BP147),\"\")","v":""},{"$f":"IFERROR(IF(Spieler!$S$11=\"SR\",Berechnung!BT147,Berechnung!BQ147+AM35),\"\")","v":""},{"$f":"IFERROR(VLOOKUP(AG35,Berechnung!$D$170:$X$209,21,FALSE),\"\")","v":""},{"$f":"IFERROR(IF(AG35=\"\",\"\",VLOOKUP(AG35,Berechnung!$D$170:$V$209,18,FALSE)),\"\")","v":""},{"$f":"IFERROR(IF(AG35=\"\",\"\",VLOOKUP(AG35,Berechnung!$D$170:$V$209,19,FALSE)),\"\")","v":""},null,0]
[null,null,null,null,null,null,null,null,null,null,null,null,null,null,null,null,null,null,null,null,null,null,null,null,null,null,null,null,null,null,null,{"$f":"IFERROR(Berechnung!BO148,\"\")","v":""},{"$f":"IFERROR(IF(Spieler!$I$2=\"\",\"\",Berechnung!BP148),\"\")","v":""},{"$f":"IFERROR(IF(Spieler!$S$11=\"SR\",Berechnung!BT148,Berechnung!BQ148+AM36),\"\")","v":""},{"$f":"IFERROR(VLOOKUP(AG36,Berechnung!$D$170:$X$209,21,FALSE),\"\")","v":""},{"$f":"IFERROR(IF(AG36=\"\",\"\",VLOOKUP(AG36,Berechnung!$D$170:$V$209,18,FALSE)),\"\")","v":""},{"$f":"IFERROR(IF(AG36=\"\",\"\",VLOOKUP(AG36,Berechnung!$D$170:$V$209,19,FALSE)),\"\")","v":""},null,0]
[{"$f":"Matches!AK9","v":148},{"$f":"Matches!X12","v":false},null,null,null,null,null,null,null,null,null,null,null,null,null,null,null,null,null,null,null,null,null,null,null,null,null,null,null,null,null,{"$f":"IFERROR(Berechnung!BO149,\"\")","v":""},{"$f":"IFERROR(IF(Spieler!$I$2=\"\",\"\",Berechnung!BP149),\"\")","v":""},{"$f":"IFERROR(IF(Spieler!$S$11=\"SR\",Berechnung!BT149,Berechnung!BQ149+AM37),\"\")","v":""},{"$f":"IFERROR(VLOOKUP(AG37,Berechnung!$D$170:$X$209,21,FALSE),\"\")","v":""},{"$f":"IFERROR(IF(AG37=\"\",\"\",VLOOKUP(AG37,Berechnung!$D$170:$V$209,18,FALSE)),\"\")","v":""},{"$f":"IFERROR(IF(AG37=\"\",\"\",VLOOKUP(AG37,Berechnung!$D$170:$V$209,19,FALSE)),\"\")","v":""},null,0]
["A2",{"$f":"VLOOKUP(2,'1. Runde Gruppen'!$N$3:P7,3,FALSE)","v":{"$error":"#N/A"}},{"$f":"RAND()*100","v":79.065308274110123},{"$f":"B38","v":{"$error":"#N/A"}},null,null,null,null,null,98.323574039486132,{"$f":"B38","v":{"$error":"#N/A"}},{"$f":"LARGE($J$38:$J$41,1)","v":98.323574039486132},{"$f":"IF($A$1>23,VLOOKUP(LARGE($J$38:$K$41,1),$J$38:$K$41,2,FALSE),IF(AND($A$1>11,$A$1<21),VLOOKUP(LARGE($J$40:$K$41,1),$J$40:$K$41,2,FALSE)))","v":false},null,"A1",null,{"$f":"IF(A2=\"X\",VLOOKUP(1,'1. Runde Gruppen'!$N3:P7,3,FALSE),\"\")","v":{"$error":"#N/A"}},null,null,null,null,null,null,null,null,null,null,null,null,null,null,{"$f":"IFERROR(Berechnung!BO150,\"\")","v":""},{"$f":"IFERROR(IF(Spieler!$I$2=\"\",\"\",Berechnung!BP150),\"\")","v":""},{"$f":"IFERROR(IF(Spieler!$S$11=\"SR\",Berechnung!BT150,Berechnung!BQ150+AM38),\"\")","v":""},{"$f":"IFERROR(VLOOKUP(AG38,Berechnung!$D$170:$X$209,21,FALSE),\"\")","v":""},{"$f":"IFERROR(IF(AG38=\"\",\"\",VLOOKUP(AG38,Berechnung!$D$170:$V$209,18,FALSE)),\"\")","v":""},{"$f":"IFERROR(IF(AG38=\"\",\"\",VLOOKUP(AG38,Berechnung!$D$170:$V$209,19,FALSE)),\"\")","v":""},null,0]
["B2",{"$f":"VLOOKUP(2,'1. Runde Gruppen'!$AD$3:AF7,3,FALSE)","v":{"$error":"#N/A"}},93.923891947633294,{"$error":"#N/A"},null,null,null,null,null,48.729126662993359,{"$f":"B39","v":{"$error":"#N/A"}},{"$f":"LARGE($J$38:$J$41,3)","v":48.729126662993359},{"$f":"IF($A$1>23,VLOOKUP(LARGE($J$38:$K$41,2),$J$38:$K$41,2,FALSE),IF(AND($A$1>11,$A$1<21),VLOOKUP(LARGE($J$40:$K$41,2),$J$40:$K$41,2,FALSE)))","v":false},null,"B1",null,{"$f":"IF(A2=\"X\",VLOOKUP(1,'1. Runde Gruppen'!$AD3:AF7,3,FALSE),\"\")","v":{"$error":"#N/A"}},null,null,null,null,null,null,null,null,null,null,null,null,null,null,{"$f":"IFERROR(Berechnung!BO151,\"\")","v":""},{"$f":"IFERROR(IF(Spieler!$I$2=\"\",\"\",Berechnung!BP151),\"\")","v":""},{"$f":"IFERROR(IF(Spieler!$S$11=\"SR\",Berechnung!BT151,Berechnung!BQ151+AM39),\"\")","v":""},{"$f":"IFERROR(VLOOKUP(AG39,Berechnung!$D$170:$X$209,21,FALSE),\"\")","v":""},{"$f":"IFERROR(IF(AG39=\"\",\"\",VLOOKUP(AG39,Berechnung!$D$170:$V$209,18,FALSE)),\"\")","v":""},{"$f":"IFERROR(IF(AG39=\"\",\"\",VLOOKUP(AG39,Berechnung!$D$170:$V$209,19,FALSE)),\"\")","v":""},null,0]
["C2",{"$f":"VLOOKUP(2,'1. Runde Gruppen'!$N$11:P15,3,FALSE)","v":{"$error":"#N/A"}},83.676567797154732,{"$error":"#N/A"},null,null,null,null,null,57.363275510006609,{"$error":"#N/A"},{"$f":"LARGE($J$38:$J$41,4)","v":45.632666577538906},{"$f":"IF($A$1>23,VLOOKUP(LARGE($J$38:$K$41,3),$J$38:$K$41,2,FALSE),IF(AND($A$1>11,$A$1<21),VLOOKUP(LARGE($J$38:$K$39,2),$J$38:$K$39,2,FALSE)))","v":false},null,"C1",null,{"$f":"IF(A2=\"X\",VLOOKUP(1,'1. Runde Gruppen'!$N11:P15,3,FALSE),\"\")","v":{"$error":"#N/A"}},null,null,null,null,null,null,null,null,null,null,null,null,null,null,{"$f":"IFERROR(Berechnung!BO152,\"\")","v":""},{"$f":"IFERROR(IF(Spieler!$I$2=\"\",\"\",Berechnung!BP152),\"\")","v":""},{"$f":"IFERROR(IF(Spieler!$S$11=\"SR\",Berechnung!BT152,Berechnung!BQ152+AM40),\"\")","v":""},{"$f":"IFERROR(VLOOKUP(AG40,Berechnung!$D$170:$X$209,21,FALSE),\"\")","v":""},{"$f":"IFERROR(IF(AG40=\"\",\"\",VLOOKUP(AG40,Berechnung!$D$170:$V$209,18,FALSE)),\"\")","v":""},{"$f":"IFERROR(IF(AG40=\"\",\"\",VLOOKUP(AG40,Berechnung!$D$170:$V$209,19,FALSE)),\"\")","v":""},null,0]
["D2",{"$f":"VLOOKUP(2,'1. Runde Gruppen'!$AD$11:AF15,3,FALSE)","v":{"$error":"#N/A"}},16.475225870833498,{"$error":"#N/A"},null,null,null,null,null,45.632666577538906,{"$error":"#N/A"},{"$f":"LARGE($J$38:$J$41,2)","v":57.363275510006609},{"$f":"IF($A$1>23,VLOOKUP(LARGE($J$38:$K$41,4),$J$38:$K$41,2,FALSE),IF(AND($A$1>11,$A$1<21),VLOOKUP(LARGE($J$38:$K$39,1),$J$38:$K$39,2,FALSE)))","v":false},null,"D1",null,{"$f":"IF(A2=\"X\",VLOOKUP(1,'1. Runde Gruppen'!$AD11:AF15,3,FALSE),\"\")","v":{"$error":"#N/A"}},null,null,null,null,null,null,null,null,null,null,null,null,null,null,{"$f":"IFERROR(Berechnung!BO153,\"\")","v":""},{"$f":"IFERROR(IF(Spieler!$I$2=\"\",\"\",Berechnung!BP153),\"\")","v":""},{"$f":"IFERROR(IF(Spieler!$S$11=\"SR\",Berechnung!BT153,Berechnung!BQ153+AM41),\"\")","v":""},{"$f":"IFERROR(VLOOKUP(AG41,Berechnung!$D$170:$X$209,21,FALSE),\"\")","v":""},{"$f":"IFERROR(IF(AG41=\"\",\"\",VLOOKUP(AG41,Berechnung!$D$170:$V$209,18,FALSE)),\"\")","v":""},{"$f":"IFERROR(IF(AG41=\"\",\"\",VLOOKUP(AG41,Berechnung!$D$170:$V$209,19,FALSE)),\"\")","v":""},null,0]
["E2",{"$f":"IFERROR(IF(AND($A$1=24,$A$2=\"\"),\"\",IF($A$1>23,VLOOKUP(2,'1. Runde Gruppen'!N19:P23,3,FALSE),)),\"\")","v":0},37.383991861997679,0,null,null,null,null,null,82.214977238272212,0,{"$f":"LARGE($J$42:$J$45,1)","v":91.427107038454309},{"$f":"VLOOKUP(L42,$J$42:$K$45,2,FALSE)","v":false},null,null,null,null,null,null,null,null,null,null,null,null,null,null,null,null,null,null,{"$f":"IFERROR(Berechnung!BO154,\"\")","v":""},{"$f":"IFERROR(IF(Spieler!$I$2=\"\",\"\",Berechnung!BP154),\"\")","v":""},{"$f":"IFERROR(IF(Spieler!$S$11=\"SR\",Berechnung!BT154,Berechnung!BQ154+AM42),\"\")","v":""},{"$f":"IFERROR(VLOOKUP(AG42,Berechnung!$D$170:$X$209,21,FALSE),\"\")","v":""},{"$f":"IFERROR(IF(AG42=\"\",\"\",VLOOKUP(AG42,Berechnung!$D$170:$V$209,18,FALSE)),\"\")","v":""},{"$f":"IFERROR(IF(AG42=\"\",\"\",VLOOKUP(AG42,Berechnung!$D$170:$V$209,19,FALSE)),\"\")","v":""},null,0]
["F2",{"$f":"IFERROR(IF(AND($A$1=24,$A$2=\"\"),\"\",IF($A$1>23,VLOOKUP(2,'1. Runde Gruppen'!AD19:AF23,3,FALSE))),\"\")","v":false},54.065785045007352,false,null,null,null,null,null,91.427107038454309,false,{"$f":"LARGE($J$42:$J$45,3)","v":54.70690774988438},{"$f":"VLOOKUP(L43,$J$42:$K$45,2,FALSE)","v":false},null,null,null,null,null,null,null,null,null,null,null,null,null,null,null,null,null,null,{"$f":"IFERROR(Berechnung!BO155,\"\")","v":""},{"$f":"IFERROR(IF(Spieler!$I$2=\"\",\"\",Berechnung!BP155),\"\")","v":""},{"$f":"IFERROR(IF(Spieler!$S$11=\"SR\",Berechnung!BT155,Berechnung!BQ155+AM43),\"\")","v":""},{"$f":"IFERROR(VLOOKUP(AG43,Berechnung!$D$170:$X$209,21,FALSE),\"\")","v":""},{"$f":"IFERROR(IF(AG43=\"\",\"\",VLOOKUP(AG43,Berechnung!$D$170:$V$209,18,FALSE)),\"\")","v":""},{"$f":"IFERROR(IF(AG43=\"\",\"\",VLOOKUP(AG43,Berechnung!$D$170:$V$209,19,FALSE)),\"\")","v":""},null,0]
["G2",{"$f":"IFERROR(IF(AND($A$1=24,$A$2=\"\"),\"\",IF($A$1>23,VLOOKUP(2,'1. Runde Gruppen'!N27:P31,3,FALSE))),\"\")","v":false},41.884255102730727,false,null,null,null,null,null,54.70690774988438,false,{"$f":"LARGE($J$42:$J$45,4)","v":31.053809419610868},{"$f":"VLOOKUP(L44,$J$42:$K$45,2,FALSE)","v":false}]
["H2",{"$f":"IFERROR(IF(AND($A$1=24,$A$2=\"\"),\"\",IF($A$1>23,VLOOKUP(2,'1. Runde Gruppen'!AD27:AF31,3,FALSE))),\"\")","v":false},64.322662810071847,false,null,null,null,null,null,31.053809419610868,false,{"$f":"LARGE($J$42:$J$45,2)","v":82.214977238272212},{"$f":"VLOOKUP(L45,$J$42:$K$45,2,FALSE)","v":0}]
[]
[]
[]
[]
[]
[]
[{"$f":"IFERROR(LARGE(D4:D26,1),\"\")","v":""},{"$f":"VLOOKUP(A52,$D$4:$I$26,4,FALSE)","v":{"$error":"#N/A"}},{"$f":"SUM(C4:C26)","v":0},{"$f":"IFERROR(LARGE(D4:F26,1),\"\")","v":""},{"$f":"VLOOKUP(D52,E4:I26,4,FALSE)","v":{"$error":"#N/A"}},{"$f":"VLOOKUP(D52,F4:I26,3,FALSE)","v":{"$error":"#N/A"}},null,null,null,null,{"$f":"SUM(K4:K26)","v":0},{"$f":"IFERROR(LARGE(L4:N26,1),\"\")","v":""},{"$f":"VLOOKUP(L52,M4:P26,4,FALSE)","v":{"$error":"#N/A"}},{"$f":"VLOOKUP(L52,N4:P26,3,FALSE)","v":{"$error":"#N/A"}},null,null,null,{"$f":"SUM(R4:R26)","v":0},{"$f":"IFERROR(LARGE(S4:U26,1),\"\")","v":""},{"$f":"VLOOKUP(S52,T4:W26,4,FALSE)","v":{"$error":"#N/A"}},{"$f":"VLOOKUP(S52,U4:W26,3,FALSE)","v":{"$error":"#N/A"}},null,null,null,{"$f":"SUM(Y14:Y24)","v":0},{"$f":"IFERROR(LARGE(Z14:AC24,1),\"\")","v":""},{"$f":"VLOOKUP(Z52,AA4:AE26,4,FALSE)","v":{"$error":"#N/A"}},{"$f":"VLOOKUP(AA52,AB4:AE26,4,FALSE)","v":{"$error":"#N/A"}},{"$f":"VLOOKUP(Z52,AC14:AE24,3,FALSE)","v":{"$error":"#N/A"}}]
[{"$f":"IFERROR(LARGE(E4:E26,1),\"\")","v":""},{"$f":"VLOOKUP(A53,E4:I26,3,FALSE)","v":{"$error":"#N/A"}},null,{"$f":"COUNT(D4:F26)","v":0},null,null,null,null,null,null,null,{"$f":"COUNT(L4:N26)","v":0},null,null,null,null,null,null,{"$f":"COUNT(S4:U26)","v":0},null,null,null,null,null,null,{"$f":"COUNT(Z14:AC24)","v":0}]
[{"$f":"IFERROR(LARGE(F4:F26,1),\"\")","v":""},{"$f":"VLOOKUP(A54,F4:I26,2,FALSE)","v":{"$error":"#N/A"}},null,{"$f":"Z53+S53+L53+D53","v":0}]
[{"$f":"IFERROR(LARGE(L6:L24,1),\"\")","v":""},{"$f":"VLOOKUP(A55,L6:P24,4,FALSE)","v":{"$error":"#N/A"}},null,{"$f":"IFERROR(LARGE(L6:O24,1),\"\")","v":2}]
[{"$f":"IFERROR(LARGE(M6:M24,1),\"\")","v":""},{"$f":"VLOOKUP(A56,M6:P24,3,FALSE)","v":{"$error":"#N/A"}},null,{"$f":"IFERROR(VLOOKUP(D52,D4:I26,5,FALSE),\"\")","v":""},null,null,null,null,null,null,null,{"$f":"IFERROR(VLOOKUP(L52,L6:P24,5,FALSE),\"\")","v":""},null,null,null,null,null,null,{"$f":"IFERROR(VLOOKUP(S52,S10:W20,5,FALSE),\"\")","v":""}]
[{"$f":"IFERROR(LARGE(N6:N24,1),\"\")","v":""},{"$f":"VLOOKUP(A57,N6:P24,2,FALSE)","v":{"$error":"#N/A"}},null,null,null,null,null,null,null,null,null,{"$f":"L52","v":""},null,null,null,null,null,null,{"$f":"S52","v":""},null,null,null,null,null,null,{"$f":"Z52","v":""}]
[{"$f":"IFERROR(LARGE(S10:S20,1),\"\")","v":""},{"$f":"VLOOKUP(A58,S10:W20,4,FALSE)","v":{"$error":"#N/A"}},null,{"$f":"LARGE(S10:V20,1)","v":{"$error":"#NUM!"}},null,null,null,null,null,null,null,{"$f":"L52","v":""}]
[{"$f":"IFERROR(LARGE(T10:T20,1),\"\")","v":""},{"$f":"VLOOKUP(A59,T10:W20,3,FALSE)","v":{"$error":"#N/A"}}]
[{"$f":"IFERROR(LARGE(U10:U20,1),\"\")","v":""},{"$f":"VLOOKUP(A60,U10:W20,2,FALSE)","v":{"$error":"#N/A"}}]
[{"$f":"IFERROR(LARGE(Z14:Z15,1),\"\")","v":""},{"$f":"VLOOKUP(A61,Z14:AE15,6,FALSE)","v":{"$error":"#N/A"}},null,{"$f":"LARGE(Z14:AD15,1)","v":0}]
[{"$f":"IFERROR(LARGE(AA14:AA15,1),\"\")","v":""},{"$f":"VLOOKUP(A62,AA14:AE15,5,FALSE)","v":{"$error":"#N/A"}}]
[{"$f":"IFERROR(LARGE(AB14:AB15,1),\"\")","v":""},{"$f":"VLOOKUP(A63,AB14:AE15,4,FALSE)","v":{"$error":"#N/A"}}]
[{"$f":"IFERROR(LARGE(AC14:AC15,1),\"\")","v":""},{"$f":"VLOOKUP(A64,AC14:AE15,3,FALSE)","v":{"$error":"#N/A"}}]
[{"$f":"IFERROR(LARGE(A52:A64,1),\"\")","v":""},{"$f":"IFERROR(VLOOKUP(A65,A52:B64,2,FALSE),\"\")","v":""},null,{"$f":"LARGE(D52:D63,1)","v":{"$error":"#NUM!"}}]

{"sheet":"Simplon GP","index":7,"n_rows":57,"n_cols":46,"rows_kept":57,"cut":false,"hidden":false,"merged":[[25,44,25,45],[26,36,26,40],[26,44,26,45],[38,37,38,43],[39,37,39,43],[25,13,25,17],[26,13,26,17],[25,11,26,12],[39,27,39,30],[25,36,25,40],[37,13,37,16],[40,13,40,16],[0,1,1,30],[36,3,36,7],[38,3,38,7],[36,0,36,1],[38,0,38,1],[37,17,37,20],[25,21,25,22],[26,21,26,22],[38,27,38,30],[19,25,20,25],[19,26,20,26],[19,27,20,30],[40,17,40,20],[20,4,20,11],[15,3,15,7],[17,1,18,1],[33,1,34,1],[27,1,28,1],[23,1,24,1],[11,3,11,7],[21,4,21,11],[20,3,21,3],[30,3,31,3],[30,4,30,11],[31,4,31,11],[1,35,1,39],[14,26,14,30],[15,26,15,30],[9,36,9,39],[9,13,9,16],[9,17,9,20],[2,23,2,34],[10,26,10,30],[11,26,11,30],[12,26,12,30],[13,26,13,30],[9,26,9,30],[2,0,2,11],[12,3,12,7],[13,3,13,7],[14,3,14,7],[45,37,45,43],[37,37,37,43],[40,37,40,43],[41,37,41,43],[42,37,42,43],[43,37,43,43],[44,37,44,43],[9,40,9,43],[9,3,9,7],[10,3,10,7],[41,0,41,1],[41,3,41,7]]}
[null,"SIMPLON Grand Prix Snooker 2025"]
[null,null,null,null,null,null,null,null,null,null,null,null,null,null,null,null,null,null,null,null,null,null,null,null,null,null,null,null,null,null,null,null,null,0,1,{"$f":"IF(AI2=2,\"Gruppen-System\",IF(AI2=1,\"K.O.-System\"))","v":"K.O.-System"}]
["GRUPPE A",null,null,null,null,null,null,null,null,null,null,null,null,null,null,null,null,null,null,null,null,null,null,"GRUPPE B",null,null,null,null,null,null,null,null,null,null,null,null,155]
[{"$f":"IF(#REF!=\"\",0,1)","v":{"$error":"#REF!"}},null,{"$f":"Berechnung!D1","v":"Spieler"},{"$f":"Berechnung!E1","v":"M"},{"$f":"Berechnung!F1","v":"W"},"+1","F+","F-",null,null,{"$f":"Berechnung!M1","v":"Rang"},{"$f":"Berechnung!N1","v":"Rang"},null,null,null,null,null,null,null,null,null,null,null,{"$f":"IF(#REF!=\"\",0,1)","v":{"$error":"#REF!"}},null,"Spieler","M","W","+1","F+","F-",null,null,"Rang","Rang"]
["A1",{"$f":"Berechnung!B2","v":1},{"$f":"IFERROR(IF(Spieler!AT2=\"\",\"\",VLOOKUP(A5,Spieler!$AU$2:$AV$9,2,FALSE)),\"\")","v":""},{"$f":"I11+I13+I15","v":0},{"$f":"J11+J13+J15","v":0},null,{"$f":"L11+L13+L15","v":0},{"$f":"M11+M13+M15","v":0},{"$f":"Berechnung!K2","v":0},{"$f":"10+E5*100+F5+G5-H5","v":10},{"$f":"IF(D5<1,\"\",RANK(J5,$J$5:$J$8))","v":""},{"$f":"K5","v":""},{"$f":"C5","v":""},null,null,null,null,null,null,null,null,null,null,"B1",1,{"$f":"IFERROR(IF(Spieler!AT3=\"\",\"\",VLOOKUP(X5,Spieler!$AU$2:$AV$9,2,FALSE)),\"\")","v":""},{"$f":"AF11+AF13+AF15","v":0},{"$f":"AG11+AG13+AG15","v":0},null,{"$f":"AI11+AI13+AI15","v":0},{"$f":"AJ11+AJ13+AJ15","v":0},{"$f":"Berechnung!AG2","v":0},{"$f":"10+AB5*100+AC5+AD5-AE5","v":10},{"$f":"IF(AA5<1,\"\",RANK(AG5,$AG$5:$AG$8))","v":""},{"$f":"AH5","v":""},{"$f":"Z5","v":""}]
["A2",{"$f":"Berechnung!B3","v":2},{"$f":"IFERROR(VLOOKUP(A6,Spieler!$AU$2:$AV$9,2,FALSE),\"\")","v":""},{"$f":"I12+I14+I15","v":0},{"$f":"J12+J14+K15","v":0},null,{"$f":"L12+L14+M15","v":0},{"$f":"M12+M14+L15","v":0},{"$f":"Berechnung!K3","v":0},{"$f":"10+E6*100+F6+G6-H6","v":10},{"$f":"IF(D6<1,\"\",RANK(J6,$J$5:$J$8))","v":""},{"$f":"K6","v":""},{"$f":"C6","v":""},null,null,null,null,null,null,null,null,null,null,"B2",2,{"$f":"IFERROR(VLOOKUP(X6,Spieler!$AU$2:$AV$9,2,FALSE),\"\")","v":""},{"$f":"AF12+AF14+AF15","v":0},{"$f":"AG12+AG14+AH15","v":0},null,{"$f":"AI12+AI14+AJ15","v":0},{"$f":"AJ12+AJ14+AI15","v":0},{"$f":"Berechnung!AG3","v":0},{"$f":"10+AB6*100+AC6+AD6-AE6","v":10},{"$f":"IF(AA6<1,\"\",RANK(AG6,$AG$5:$AG$8))","v":""},{"$f":"AH6","v":""},{"$f":"Z6","v":""}]
["A3",{"$f":"Berechnung!B4","v":3},{"$f":"IFERROR(VLOOKUP(A7,Spieler!$AU$2:$AV$9,2,FALSE),\"\")","v":""},{"$f":"I12+I13+I16","v":0},{"$f":"K12+K13+J16","v":0},null,{"$f":"M12+M13+L16","v":0},{"$f":"L12+L13+M16","v":0},{"$f":"Berechnung!K4","v":0},{"$f":"10+E7*100+F7+G7-H7","v":10},{"$f":"IF(D7<1,\"\",RANK(J7,$J$5:$J$8))","v":""},{"$f":"K7","v":""},{"$f":"C7","v":""},null,null,null,null,null,null,null,null,null,null,"B3",3,{"$f":"IFERROR(VLOOKUP(X7,Spieler!$AU$2:$AV$9,2,FALSE),\"\")","v":""},{"$f":"AF12+AF13+AF16","v":0},{"$f":"AH12+AH13+AG16","v":0},null,{"$f":"AJ12+AJ13+AI16","v":0},{"$f":"AI12+AI13+AJ16","v":0},{"$f":"Berechnung!AG4","v":0},{"$f":"10+AB7*100+AC7+AD7-AE7","v":10},{"$f":"IF(AA7<1,\"\",RANK(AG7,$AG$5:$AG$8))","v":""},{"$f":"AH7","v":""},{"$f":"Z7","v":""}]
["A4",4,{"$f":"IFERROR(VLOOKUP(A8,Spieler!$AU$2:$AV$9,2,FALSE),\"\")","v":""},{"$f":"I11+I14+I16","v":0},{"$f":"K11+K14+K16","v":0},null,{"$f":"M11+M14+M16","v":0},{"$f":"L11+L14+L16","v":0},{"$f":"Berechnung!K5","v":0},{"$f":"10+E8*100+F8+G8-H8","v":10},{"$f":"IF(D8<1,\"\",RANK(J8,$J$5:$J$8))","v":""},{"$f":"K8","v":""},{"$f":"C8","v":""},null,null,null,null,null,null,null,null,null,null,"B4",4,{"$f":"IFERROR(VLOOKUP(X8,Spieler!$AU$2:$AV$9,2,FALSE),\"\")","v":""},{"$f":"AF11+AF14+AF16","v":0},{"$f":"AH11+AH14+AH16","v":0},null,{"$f":"AJ11+AJ14+AJ16","v":0},{"$f":"AI11+AI14+AI16","v":0},{"$f":"Berechnung!AG5","v":0},{"$f":"10+AB8*100+AC8+AD8-AE8","v":10},{"$f":"IF(AA8<1,\"\",RANK(AG8,$AG$5:$AG$8))","v":""},{"$f":"AH8","v":""},{"$f":"Z8","v":""}]
[null,null,null,{"$f":"SUM(D5:D8)","v":0},null,null,null,null,null,null,null,null,null,null,null,null,null,null,null,null,null,null,null,null,null,null,{"$f":"SUM(AA5:AA8)","v":0}]
[null,null,"Spieler","Spieler",null,null,null,null,"Matches","Win","Lose","F+","F-","Break 30+ S1",null,null,null,"Break 30+ S2",null,null,null,null,null,null,null,"Spieler","Spieler",null,null,null,null,"Matches","Win","Lose","F+","F-","Break 30+ S1",null,null,null,"Break 30+ S2"]
["1-4",1,{"$f":"C5","v":""},{"$f":"C8","v":""},null,null,null,null,{"$f":"IF(L11+M11>1,1,0)","v":0},{"$f":"IF(L11>M11,1,0)","v":0},{"$f":"IF(M11>L11,1,0)","v":0},0,0,null,null,null,null,null,null,null,null,{"$f":"C11","v":""},"","1-4",1,{"$f":"Z5","v":""},{"$f":"Z8","v":""},null,null,null,null,{"$f":"IF(AI11+AJ11>1,1,0)","v":0},{"$f":"IF(AI11>AJ11,1,0)","v":0},{"$f":"IF(AJ11>AI11,1,0)","v":0},0,0,null,null,null,null,null,null,null,null,{"$f":"Z11","v":""},""]
["2-3",2,{"$f":"C6","v":""},{"$f":"C7","v":""},null,null,null,null,0,0,0,0,0,null,null,null,null,null,null,null,null,"","","2-3",2,{"$f":"Z6","v":""},{"$f":"Z7","v":""},null,null,null,null,0,0,0,0,0,null,null,null,null,null,null,null,null,"",""]
["1-3",3,{"$f":"C5","v":""},{"$f":"C7","v":""},null,null,null,null,0,0,0,0,0,null,null,null,null,null,null,null,null,"","","1-3",3,{"$f":"Z5","v":""},{"$f":"Z7","v":""},null,null,null,null,0,0,0,0,0,null,null,null,null,null,null,null,null,"",""]
["2-4",4,{"$f":"C6","v":""},{"$f":"C8","v":""},null,null,null,null,0,0,0,0,0,null,null,null,null,null,null,null,null,"","","2-4",4,{"$f":"Z6","v":""},{"$f":"Z8","v":""},null,null,null,null,0,0,0,0,0,null,null,null,null,null,null,null,null,"",""]
["1-2",5,{"$f":"C5","v":""},{"$f":"C6","v":""},null,null,null,null,0,0,0,0,0,null,null,null,null,null,null,null,null,"","","1-2",5,{"$f":"Z5","v":""},{"$f":"Z6","v":""},null,null,null,null,0,0,0,0,0,null,null,null,null,null,null,null,null,"",""]
["3-4",6,{"$f":"C7","v":""},{"$f":"C8","v":""},null,null,null,null,0,0,0,0,0,null,null,null,null,null,null,null,null,"","","3-4",6,{"$f":"Z7","v":""},{"$f":"Z8","v":""},null,null,null,null,0,0,0,0,0,null,null,null,null,null,null,null,null,"",""]
[null,null,null,null,null,null,null,null,null,null,null,null,null,{"$f":"IFERROR(LARGE(N11:N16,1),0)","v":0},0,0,0,0,0,0,0,{"$f":"LARGE(N17:U17,1)","v":0},{"$f":"LARGE(N17:U17,1)","v":0},null,null,null,null,null,null,null,null,null,null,null,{"$f":"SUM(AI11:AI16)","v":0},{"$f":"SUM(AJ11:AJ16)","v":0},{"$f":"IFERROR(LARGE(AK11:AK16,1),0)","v":0},0,0,0,0,0,0,0,{"$f":"LARGE(AK17:AR17,1)","v":0}]
[null,"VF1",{"$f":"IFERROR(IF($AI$2=2,VLOOKUP(\"A1\",Spieler!$AU$2:$AV$9,2,FALSE),IF($AI$2=1,\"\")),\"\")","v":""},0,null,null,null,null,null,null,null,{"$f":"IFERROR(LARGE(E18:H18,1),0)","v":0},{"$f":"C18","v":""},null,null,null,null,null,null,null,null,null,null,null,null,"Anzahl gespielter Frames:",{"$f":"D18+D19+D24+D25+D28+D29+D34+D35+M32+M31+M22+M21+S26+S27","v":0}]
[null,null,{"$f":"IFERROR(IF($AI$2=2,VLOOKUP(\"B4\",Spieler!$AU$2:$AV$9,2,FALSE),IF($AI$2=1,\"\")),\"\")","v":""},0,null,null,null,null,null,null,null,{"$f":"IFERROR(LARGE(E19:H19,1),0)","v":0},{"$f":"C19","v":""},null,null,null,null,null,null,null,null,null,null,null,null,"Anzahl Breaks 30+:",{"$f":"P57","v":0}]
[null,null,null,{"$f":"IF(D18+D19<2,\"\",IF(D18>D19,C18,C19))","v":""},null,null,null,null,null,null,null,null,null,null,null,null,null,null,null,null,null,null,null,null,null,"Highbreak 30+:",{"$f":"L57","v":0},{"$f":"IF(AA20=0,\"\",M57)","v":""}]
[null,null,null,"HF1",{"$f":"IFERROR(IF($AI$2=2,D20,IF($AI$2=1,VLOOKUP(1,$L$5:$M$8,2,FALSE))),\"\")","v":""},null,null,null,null,null,null,null,0,null,null,null,null,{"$f":"IFERROR(LARGE(K21:N21,1),0)","v":0},{"$f":"I21","v":0}]
[null,null,null,null,{"$f":"IFERROR(IF($AI$2=2,D23,IF($AI$2=1,VLOOKUP(2,$AI$5:$AJ$8,2,FALSE))),\"\")","v":""},null,null,null,null,null,null,null,0,null,null,null,null,{"$f":"IFERROR(LARGE(K22:N22,1),0)","v":0},{"$f":"I22","v":0}]
[null,null,null,{"$f":"IF(D24+D25<2,\"\",IF(D24>D25,C24,C25))","v":""}]
[null,"VF2",{"$f":"IFERROR(IF($AI$2=2,VLOOKUP(\"B2\",Spieler!$AU$2:$AV$9,2,FALSE),IF($AI$2=1,\"\")),\"\")","v":""},0,null,null,null,null,null,null,null,{"$f":"IFERROR(LARGE(E24:H24,1),0)","v":0},{"$f":"C24","v":""}]
[null,null,{"$f":"IFERROR(IF($AI$2=2,VLOOKUP(\"A3\",Spieler!$AU$2:$AV$9,2,FALSE),IF($AI$2=1,\"\")),\"\")","v":""},0,null,null,null,null,null,null,null,{"$f":"IFERROR(LARGE(E25:H25,1),0)","v":0},{"$f":"C25","v":""}]
[null,null,null,null,null,null,null,null,null,null,null,"Finale",null,{"$f":"IFERROR(IF(M21+M22<2,\"\",IF(M21>M22,E21,E22)),\"\")","v":""},null,null,null,null,0,null,null,null,null,null,null,{"$f":"IFERROR(LARGE(S26:V26,1),0)","v":0},{"$f":"Q26","v":0}]
[null,null,null,null,null,null,null,null,null,null,null,null,null,{"$f":"IFERROR(IF(M31+M32<2,\"\",IF(M31>M32,E31,E32)),\"\")","v":""},null,null,null,null,0,null,null,null,null,null,null,{"$f":"IFERROR(LARGE(S27:V27,1),0)","v":0},{"$f":"Q27","v":0}]
[null,"VF3",{"$f":"IFERROR(IF($AI$2=2,VLOOKUP(\"A2\",Spieler!$AU$2:$AV$9,2,FALSE),IF($AI$2=1,\"\")),\"\")","v":""},0,null,null,null,null,null,null,null,{"$f":"IFERROR(LARGE(E28:H28,1),0)","v":0},{"$f":"C28","v":""}]
[null,null,{"$f":"IFERROR(IF($AI$2=2,VLOOKUP(\"B3\",Spieler!$AU$2:$AV$9,2,FALSE),IF($AI$2=1,\"\")),\"\")","v":""},0,null,null,null,null,null,null,null,{"$f":"IFERROR(LARGE(E29:H29,1),0)","v":0},{"$f":"C29","v":""}]
[null,null,null,{"$f":"IF(D28+D29<2,\"\",IF(D28>D29,C28,C29))","v":""}]
[null,null,null,"HF2",{"$f":"IFERROR(IF($AI$2=2,D30,IF($AI$2=1,VLOOKUP(1,$AI$5:$AJ$8,2,FALSE))),\"\")","v":""},null,null,null,null,null,null,null,0,null,null,null,null,{"$f":"IFERROR(LARGE(K31:N31,1),0)","v":0},{"$f":"I31","v":0}]
[null,null,null,null,{"$f":"IFERROR(IF($AI$2=2,D33,IF($AI$2=1,VLOOKUP(2,$L$5:$M$8,2,FALSE))),\"\")","v":""},null,null,null,null,null,null,null,0,null,null,null,null,{"$f":"IFERROR(LARGE(K32:N32,1),0)","v":0},{"$f":"I32","v":0}]
[null,null,null,{"$f":"IF(D34+D35<2,\"\",IF(D34>D35,C34,C35))","v":""}]
[null,"VF4",{"$f":"IFERROR(IF($AI$2=2,VLOOKUP(\"B1\",Spieler!$AU$2:$AV$9,2,FALSE),IF($AI$2=1,\"\")),\"\")","v":""},0,null,null,null,null,null,null,null,{"$f":"IFERROR(LARGE(E34:H34,1),0)","v":0},{"$f":"C34","v":""}]
[null,null,{"$f":"IFERROR(IF($AI$2=2,VLOOKUP(\"A4\",Spieler!$AU$2:$AV$9,2,FALSE),IF($AI$2=1,\"\")),\"\")","v":""},0,null,null,null,null,null,null,null,{"$f":"IFERROR(LARGE(E35:H35,1),0)","v":0},{"$f":"C35","v":""}]
[null,null,null,null,null,null,null,null,null,null,null,"F+","F-",{"$f":"VLOOKUP(N17,$N$11:$V$16,9,FALSE)","v":{"$error":"#N/A"}},{"$f":"VLOOKUP(O17,$O$11:$V$16,8,FALSE)","v":{"$error":"#N/A"}},{"$f":"VLOOKUP(P17,$P$11:$V$16,7,FALSE)","v":{"$error":"#N/A"}},{"$f":"VLOOKUP(Q17,$Q$11:$V$16,6,FALSE)","v":{"$error":"#N/A"}},{"$f":"VLOOKUP(R17,$R$11:$W$16,6,FALSE)","v":{"$error":"#N/A"}},{"$f":"VLOOKUP(S17,$S$11:$W$16,5,FALSE)","v":{"$error":"#N/A"}},{"$f":"VLOOKUP(T17,$T$11:$W$16,4,FALSE)","v":{"$error":"#N/A"}},{"$f":"VLOOKUP(U17,$U$11:$W$16,3,FALSE)","v":{"$error":"#N/A"}},{"$f":"HLOOKUP(V17,N17:U36,20,FALSE)","v":{"$error":"#N/A"}},{"$f":"HLOOKUP(W17,N17:U36,20,FALSE)","v":{"$error":"#N/A"}},null,null,null,null,null,null,null,null,null,null,null,null,null,{"$f":"VLOOKUP(AK17,$AK$11:$AS$16,9,FALSE)","v":{"$error":"#N/A"}},{"$f":"VLOOKUP(AL17,$AL$11:$AS$16,8,FALSE)","v":{"$error":"#N/A"}},{"$f":"VLOOKUP(AM17,$AM$11:$AS$16,7,FALSE)","v":{"$error":"#N/A"}},{"$f":"VLOOKUP(AN17,$AN$11:$AS$16,6,FALSE)","v":{"$error":"#N/A"}},{"$f":"VLOOKUP(AO17,$AO$11:$AT$16,6,FALSE)","v":{"$error":"#N/A"}},{"$f":"VLOOKUP(AP17,$AP$11:$AT$16,5,FALSE)","v":{"$error":"#N/A"}},{"$f":"VLOOKUP(AQ17,$AQ$11:$AT$16,4,FALSE)","v":{"$error":"#N/A"}},{"$f":"VLOOKUP(AR17,$AR$11:$AT$16,3,FALSE)","v":{"$error":"#N/A"}},{"$f":"HLOOKUP(AS17,AK17:AR36,20,FALSE)","v":{"$error":"#N/A"}}]
["HF1",null,{"$f":"IFERROR(IF(D9<12,\"\",VLOOKUP(1,$L$5:$M$8,2,FALSE)),\"\")","v":""},{"$f":"IFERROR(IF(AA9<12,\"\",VLOOKUP(2,$AI$5:$AJ$8,2,FALSE)),\"\")","v":""},null,null,null,null,null,null,null,0,0,null,null,null,null,null,null,null,null,{"$f":"C37","v":""},{"$f":"D37","v":""},null,null,"Anzahl gespielter Frames:",{"$f":"V47","v":0},{"$f":"W17","v":0},{"$f":"AS17","v":0},{"$f":"W36","v":{"$error":"#N/A"}},{"$f":"AS36","v":{"$error":"#N/A"}},null,null,null,null,null,null,null,null,null,null,null,{"$f":"LARGE(AS17:AT17,1)","v":0},{"$f":"IF(AS17>AT17,AS36,AT36)","v":0}]
[null,null,null,null,null,null,null,null,null,null,null,"F+","F-","Break 30+ S1",null,null,null,"Break 30+ S2",null,null,null,null,null,null,null,"Anzahl Breaks 30+:",{"$f":"V48","v":0},null,null,null,null,null,null,null,null,null,null,"Ranking"]
["HF2",null,{"$f":"IFERROR(IF(AA9<12,\"\",VLOOKUP(1,$AI$5:$AJ$8,2,FALSE)),\"\")","v":""},{"$f":"IFERROR(IF(D9<12,\"\",VLOOKUP(2,$L$5:$M$8,2,FALSE)),\"\")","v":""},null,null,null,null,null,null,null,0,0,null,null,null,null,null,null,null,null,{"$f":"C39","v":""},{"$f":"D39","v":""},null,null,"Highbreak Gruppenphase:",{"$f":"LARGE(AB37:AC37,1)","v":0},{"$f":"IFERROR(IF(AC37>AB37,AE37,AD37),\"\")","v":""},null,null,null,null,null,null,null,null,"1.",{"$f":"IF(L42+M42<2,\"\",IF(L42>M42,C42,D42))","v":""}]
[null,null,null,null,null,null,null,null,null,null,null,null,null,null,null,null,null,null,null,null,null,null,null,null,null,"Highbreak Finals:",{"$f":"V46","v":0},{"$f":"W46","v":""},null,null,null,null,null,null,null,null,"2.",{"$f":"IF(L42+M42<2,\"\",IF(L42>M42,D42,C42))","v":""}]
[null,null,null,null,null,null,null,null,null,null,null,"F+","F-","Break 30+ S1",null,null,null,"Break 30+ S2",null,null,null,null,null,null,null,null,null,null,null,null,null,null,null,null,null,null,"3.",{"$f":"IF(L37+M37<2,\"\",IF(L37>M37,D37,C37))","v":""}]
["Finale",null,{"$f":"IF(L37+M37<2,\"\",IF(L37>M37,C37,D37))","v":""},{"$f":"IF(L39+M39<2,\"\",IF(L39>M39,C39,D39))","v":""},null,null,null,null,null,null,null,0,0,null,null,null,null,null,null,null,null,{"$f":"C42","v":""},{"$f":"D42","v":""},null,null,null,null,null,null,null,null,null,null,null,null,null,"4.",{"$f":"IF(L39+M39<2,\"\",IF(L39>M39,D39,C39))","v":""}]
[null,null,null,null,null,null,null,null,null,null,null,{"$f":"SUM(L11:L16)+L37+L39+L42","v":0},{"$f":"SUM(M11:M16)+M37+M39+M42","v":0},{"$f":"IFERROR(LARGE(N37:Q37,1),0)","v":0},{"$f":"IFERROR(LARGE(R37:U37,1),0)","v":0},null,null,{"$f":"C37","v":""},{"$f":"D37","v":""},null,null,{"$f":"LARGE(N43:O43,1)","v":0},{"$f":"IF(N43>O43,R43,IF(O43>N43,S43,\"\"))","v":""},null,null,null,null,null,null,null,null,null,null,null,null,null,"5.",{"$f":"IFERROR(IF(D9<12,\"\",VLOOKUP(SMALL(J5:J8,2),J5:M8,4,FALSE)),\"\")","v":""}]
[null,null,null,null,null,null,null,null,null,null,null,null,null,{"$f":"IFERROR(LARGE(N39:Q39,1),0)","v":0},{"$f":"IFERROR(LARGE(R39:U39,1),0)","v":0},null,null,{"$f":"C39","v":""},{"$f":"D39","v":""},null,null,{"$f":"LARGE(N44:O44,1)","v":0},{"$f":"IF(N44>O44,R44,IF(O44>N44,S44,\"\"))","v":""},null,null,null,null,null,null,null,null,null,null,null,null,null,"6.",{"$f":"IFERROR(IF(AA9<12,\"\",VLOOKUP(SMALL(AG5:AG8,2),AG5:AJ8,4,FALSE)),\"\")","v":""}]
[null,null,null,null,null,null,null,null,null,null,null,null,null,{"$f":"IFERROR(LARGE(N42:Q42,1),0)","v":0},{"$f":"IFERROR(LARGE(R42:U42,1),0)","v":0},null,null,{"$f":"C42","v":""},{"$f":"D42","v":""},null,null,{"$f":"LARGE(N45:O45,1)","v":0},{"$f":"IF(N45>O45,R45,IF(O45>N45,S45,\"\"))","v":""},null,null,null,null,null,null,null,null,null,null,null,null,null,"7.",{"$f":"IFERROR(IF(D9<12,\"\",VLOOKUP(SMALL(J5:J8,1),J5:M8,4,FALSE)),\"\")","v":""}]
[null,null,null,null,null,null,null,null,null,null,null,null,null,null,null,null,null,null,null,null,null,{"$f":"IFERROR(LARGE(V43:V45,1),0)","v":0},{"$f":"VLOOKUP(V46,V43:W45,2,FALSE)","v":""},null,null,null,null,null,null,null,null,null,null,null,null,null,"8.",{"$f":"IFERROR(IF(AA9<12,\"\",VLOOKUP(SMALL(AG5:AG8,1),AG5:AJ8,4,FALSE)),\"\")","v":""}]
[null,null,null,null,null,null,null,null,null,null,null,null,null,null,null,null,null,null,null,null,null,{"$f":"L43+M43+AI17+AJ17","v":0},"Frames gesamt"]
[null,null,null,null,null,null,null,null,null,null,null,null,null,{"$f":"COUNT(N11:U16)","v":0},{"$f":"COUNT(AK11:AR16)","v":0},{"$f":"COUNT(N37:U37)","v":0},{"$f":"COUNT(N39:U39)","v":0},{"$f":"COUNT(N42:U42)","v":0},null,null,null,{"$f":"SUM(N48:R48)","v":0},"Anzahl Breaks"]
[]
[null,null,null,null,null,null,null,null,null,null,null,{"$f":"LARGE(L18:L19,1)","v":0},{"$f":"VLOOKUP(L50,L18:N19,2,FALSE)","v":""},null,null,{"$f":"COUNT(E18:H19)","v":0}]
[null,null,null,null,null,null,null,null,null,null,null,{"$f":"LARGE(L24:L25,1)","v":0},{"$f":"VLOOKUP(L51,L24:M25,2,FALSE)","v":""},null,null,{"$f":"COUNT(N21:Q22)","v":0}]
[null,null,null,null,null,null,null,null,null,null,null,{"$f":"LARGE(L28:L29,1)","v":0},{"$f":"VLOOKUP(L52,L28:M29,2,FALSE)","v":""},null,null,{"$f":"COUNT(E24:H25)","v":0}]
[null,null,null,null,null,null,null,null,null,null,null,{"$f":"LARGE(L34:L35,1)","v":0},{"$f":"VLOOKUP(L53,L34:M35,2,FALSE)","v":""},null,null,{"$f":"COUNT(T26:Y27)","v":0}]
[null,null,null,null,null,null,null,null,null,null,null,{"$f":"LARGE(R21:R22,1)","v":0},{"$f":"VLOOKUP(L54,R21:S22,2,FALSE)","v":0},null,null,{"$f":"COUNT(E28:H29)","v":0}]
[null,null,null,null,null,null,null,null,null,null,null,{"$f":"LARGE(R31:R32,1)","v":0},{"$f":"VLOOKUP(L55,R31:S32,2,FALSE)","v":0},null,null,{"$f":"COUNT(N31:Q32)","v":0}]
[null,null,null,null,null,null,null,null,null,null,null,{"$f":"LARGE(Z26:Z27,1)","v":0},{"$f":"VLOOKUP(L56,Z26:AA27,2,FALSE)","v":0},null,null,{"$f":"COUNT(E34:H35)","v":0}]
[null,null,null,null,null,null,null,null,null,null,null,{"$f":"LARGE(L50:L56,1)","v":0},{"$f":"VLOOKUP(L57,L50:M56,2,FALSE)","v":""},null,null,{"$f":"SUM(P50:P56)","v":0}]